program: Gaussian 09
title: 000287138
version: EM64L-G09RevD.01
frameworkgroup: C1[X(C14H26BrO5P)]
method: RPBEPBE
basis: SDD
operation: Freq
keyword: #p
keyword: freq=noraman
keyword: PBEPBE/SDD
title: #p freq=noraman PBEPBE/SDD
converged: NO YES NO NO
title: Mulliken charges:
elementType: Br P O O O O O C C C C C C C C C C C C C C H H H H H H H H H H H H H H H H H H H H H H H H H H
charge: -0.029495 1.291862 -0.490237 -0.542002 -0.275607 -0.614945 -0.177583 -0.251215 -0.257348 0.365388 -0.209093 -0.246472 -0.373824 -0.344222 0.339221 -0.641934 -0.644049 -0.772899 -0.807606 -0.681160 -0.674116 0.208039 0.215257 0.205475 0.249745 0.217967 0.219279 0.227113 0.197058 0.237595 0.262756 0.237552 0.230992 0.267755 0.242871 0.258693 0.259805 0.229011 0.299298 0.235733 0.235079 0.213031 0.208328 0.228834 0.201709 0.226945 0.221416
chargesum: 0.00000
title: Mulliken charges with hydrogens summed into heavy atoms:
elementType: Br P O O O O O C C C C C C C C C C C C C C
charge: -0.029495 1.291862 -0.490237 -0.542002 -0.275607 -0.614945 -0.177583 -0.251215 -0.257348 0.365388 0.214204 0.208747 0.063422 0.079949 0.339221 0.095969 0.097569 -0.025390 -0.037496 -0.030966 -0.024046
polarizability: 2.20173884e+02 1.12988049e+01 2.05746831e+02 -2.27112830e+00 -8.73504321e+00 2.20009448e+02
1716.lowfreq: -8.5887 -5.9437 -1.6933 -0.0015 -0.0015 -0.0014 10.0766 17.9566 22.5232
frequency: -4.8139 17.2785 22.2265 29.0380 38.9853 39.9817 47.8715 49.7708 72.5714 74.6822 91.5616 106.4904 110.5814 117.1758 138.3421 151.3527 163.8409 176.6095 183.1109 186.9173 207.7745 214.7716 227.5301 235.3108 238.8001 248.6399 261.7995 267.3497 284.6433 296.1741 318.6532 326.9336 328.4254 361.6474 386.3507 407.0091 417.9344 436.0452 441.6046 465.9511 500.2873 541.7068 592.5272 629.5008 672.7767 696.5984 707.2249 762.3368 776.9178 786.1498 862.6861 882.9505 886.7698 891.5601 905.3790 910.5809 918.8065 945.3939 957.1019 961.2757 980.5412 1006.0438 1021.7047 1041.5536 1048.5274 1051.3146 1065.0149 1084.4242 1106.1932 1108.9195 1112.1714 1128.9889 1132.6944 1141.8382 1214.7707 1225.9922 1240.3082 1241.7281 1257.5208 1273.8426 1278.6311 1305.0310 1354.3351 1364.9775 1368.7083 1385.6522 1387.3766 1388.0141 1391.0847 1402.9691 1403.6909 1447.2229 1451.4610 1452.9143 1454.7564 1460.2933 1463.7406 1464.4015 1471.1179 1475.4627 1476.0060 1477.7098 1478.1852 1481.0174 1484.6005 1484.7973 1489.1382 1648.5406 1658.0857 2968.5559 2972.4782 2977.0899 2979.1526 2981.4240 2982.4889 2986.7698 2991.2323 2991.9962 3006.9175 3029.4635 3043.0464 3050.2091 3054.1616 3061.0769 3067.2379 3077.8398 3082.2165 3082.8118 3086.3950 3088.9911 3091.4739 3100.4006 3103.1492 3129.8100 3133.1847
redmass: 3.2531 4.2010 4.7272 2.3508 1.9821 4.7035 5.9619 3.3634 3.0798 4.7732 3.3364 5.2675 2.6057 2.6524 1.4702 3.7104 1.0697 3.5250 3.1609 1.6393 1.2369 4.3084 1.0807 2.2222 2.5059 3.9644 3.3118 2.9427 1.6910 3.9129 2.4885 4.3094 3.2092 3.4598 4.0201 3.0408 4.6925 3.3139 3.1583 4.4134 5.7722 5.2552 4.7518 4.8908 5.9631 6.9906 6.6097 1.0747 1.4683 8.5036 3.1143 1.1441 2.8759 2.1486 1.3008 2.9340 3.2984 1.3974 5.1974 1.3338 1.3478 1.3357 6.6512 8.6961 3.0571 3.3516 1.7929 1.6738 2.1784 1.8561 1.7387 2.2061 1.7286 1.4494 4.4244 1.2651 2.9094 1.2397 4.8139 1.1646 1.1025 1.3259 1.4693 1.2262 1.3863 1.2257 1.1953 1.1958 1.2078 1.1872 1.1926 1.0470 1.0665 1.0765 1.0504 1.0680 1.0516 1.0721 1.0657 1.0520 1.0568 1.0727 1.0419 1.0654 1.0527 1.0556 1.0840 8.5002 8.1583 1.0549 1.0375 1.0365 1.0439 1.0526 1.0377 1.0405 1.0596 1.0401 1.0600 1.1057 1.0990 1.0966 1.1020 1.1066 1.0955 1.1002 1.1000 1.1027 1.0941 1.0994 1.0940 1.1004 1.1006 1.1009 1.1002
irintensity: 0.1866 0.2589 1.4157 0.6600 0.8367 0.4987 1.6243 1.0828 1.7115 0.0422 1.2114 0.9083 0.0218 1.0894 0.0989 1.1725 0.3458 1.5293 5.9468 0.7002 1.7073 13.9074 0.0290 1.2818 2.6616 3.2652 6.3382 10.8020 4.7962 3.0292 4.5175 2.4132 8.7020 5.3402 2.0120 2.0041 29.6313 6.5416 2.7361 21.2804 77.5386 7.6281 6.7158 84.4864 28.7285 29.8407 117.0344 4.5123 20.5148 11.9667 78.9413 2.3390 10.4529 14.5484 7.7453 3.9223 196.5890 3.1490 167.2855 15.5099 1.5100 20.1054 145.9514 14.9920 27.9387 417.5035 35.1072 10.4738 3.8829 22.0140 93.7363 2.9623 0.4379 0.5781 8.2717 0.1746 16.3533 1.2491 12.1303 5.7601 0.1982 0.3550 0.3079 6.2323 3.4076 15.7734 35.4828 11.7081 14.3508 23.2545 29.1452 6.7728 18.7495 10.8235 0.3202 10.1561 8.8618 4.6583 9.9434 22.9862 7.7979 6.8451 14.8680 7.1944 26.7642 11.5186 22.3355 120.0442 42.6778 23.2582 24.5662 38.4392 39.6138 11.2549 20.2584 3.1814 52.9184 13.7446 26.7781 12.2822 4.4798 10.1771 0.1973 8.8744 14.9113 54.4860 54.2616 69.3531 4.3945 81.4217 16.6415 2.2991 7.5551 5.8083 13.8708
temp: 298.150 k
press: 1.00000 atm
elementType: 35 15 8 8 8 8 8 6 6 6 6 6 6 6 6 6 6 6 6 6 6 1 1 1 1 1 1 1 1 1 1 1 1 1 1 1 1 1 1 1 1 1 1 1 1 1 1
symmnumber: 1
zpe: 1001476.9 jmol-1
zpe.correction: 0.381442 hartree
zpe.thermalcorrener: 0.409155 hartree
zpe.thermalcorrenthalpy: 0.410099 hartree
zpe.thermalcorrgfe: 0.320048 hartree
zpe.sumelectzpe: -1278.175317 hartree
zpe.sumelectthermal: -1278.147605 hartree
zpe.sumelectthermalent: -1278.146661 hartree
zpe.sumelectthermalfe: -1278.236712 hartree
dipole: -1.7296 -0.3836 -2.6591
dipole: 3.1952
quadrupole: -164.7520 -138.5142 -130.9761
quadrupole: -0.0611 -7.8185 -7.6203
quadrupole: -20.0046 6.2333 13.7713 -0.0611 -7.8185 -7.6203
hfenergy: -1278.5567593 hartree
pointgroup: C01 [X(C14H26Br1O5P1)]
dipole: -0.1864458 -0.6596201 1.0537724 debye
polarizability: 209.5490267|-11.0481768|222.6359324|-10.5184794|-0.6051632|213.7452048 unknown
InChI: InChI=1S/C14H26BrO5P/c1-7-9-18-21(17,19-10-8-2)12(11(3)4)20-13(16)14(5,6)15/h7-10H2,1-6H3
charge 0 multiplicity 1
47 atoms
Br -2.994448 0.543797 2.932736
P  1.607219 0.498292 -1.031421
O  2.851875 0.804316 0.145643
O  1.134556 -1.160466 -0.772486
O  -0.510894 0.668885 0.674169
O  2.166503 0.821034 -2.486891
O  -2.307927 -0.135839 -0.599813
C  0.062061 1.350013 -0.454467
C  -2.038442 -0.888089 1.743673
C  -0.469836 2.499035 -0.956077
C  2.600327 0.553076 1.590883
C  1.843592 -2.208895 -1.572993
C  3.91225 0.849979 2.320699
C  0.80186 -3.108605 -2.245098
C  -1.678549 -0.105669 0.470923
C  -0.82109 -1.394174 2.525811
C  -3.074654 -1.974541 1.440519
C  -1.749493 3.068488 -0.374051
C  0.143143 3.264068 -2.109601
C  3.770968 0.627803 3.843685
C  -0.100915 -3.85897 -1.245087
H  2.290191 -0.501484 1.730225
H  1.784534 1.214945 1.944801
H  2.468899 -2.776762 -0.859045
H  2.488889 -1.718056 -2.326582
H  4.705356 0.199838 1.90749
H  4.209299 1.893756 2.109569
H  0.187116 -2.492998 -2.927653
H  1.352574 -3.837622 -2.874589
H  -0.245173 -2.086705 1.881013
H  -0.157102 -0.569118 2.8211
H  -1.152314 -1.93604 3.427218
H  -2.602548 -2.760911 0.819884
H  -3.931916 -1.570117 0.881495
H  -3.430793 -2.431539 2.377986
H  -1.920503 2.751438 0.66779
H  -2.612442 2.723301 -0.975937
H  -1.731492 4.171742 -0.417166
H  1.003795 2.752909 -2.568789
H  0.460905 4.266571 -1.763594
H  -0.625484 3.425211 -2.889698
H  2.997741 1.289244 4.277732
H  3.491293 -0.417576 4.074528
H  4.723658 0.841743 4.359538
H  0.496063 -4.505509 -0.573848
H  -0.66229 -3.140122 -0.622968
H  -0.831057 -4.498279 -1.773059
