program: Gaussian 09
title: 000027497
version: EM64L-G09RevD.01
frameworkgroup: C1[X(C17H21NO2)]
method: RPBEPBE
basis: SDD
operation: Freq
keyword: #p
keyword: freq=noraman
keyword: PBEPBE/SDD
title: #p freq=noraman PBEPBE/SDD
converged: YES YES NO NO
title: Mulliken charges:
elementType: O O N C C C C C C C C C C C C C C C C C H H H H H H H H H H H H H H H H H H H H H
charge: -0.460018 -0.267480 -0.323250 -0.064666 -0.242954 -0.727518 0.440777 -0.488288 0.431961 -0.385250 -0.392264 -0.437931 -0.373186 -0.238555 -0.227262 -0.245122 -0.348579 -0.350665 0.318682 -0.538174 0.168306 0.193328 0.244855 0.241484 0.243905 0.216406 0.233768 0.189952 0.239607 0.278961 0.336741 0.234036 0.259696 0.220283 0.221555 0.223589 0.249022 0.238802 0.220982 0.244484 0.219978
chargesum: 0.00000
title: Mulliken charges with hydrogens summed into heavy atoms:
elementType: O O N C C C C C C C C C C C C C C C C C
charge: -0.123277 -0.267480 -0.078396 0.103640 -0.049626 -0.025723 0.440777 -0.064568 0.431961 -0.145643 -0.113303 -0.203895 -0.113489 -0.018272 -0.005707 -0.021533 -0.099556 -0.111862 0.318682 0.147269
polarizability: 2.57160801e+02 -1.02752467e+01 2.16544479e+02 2.14855248e+01 8.52858994e+00 1.15535926e+02
1716.lowfreq: -11.0920 0.0008 0.0008 0.0009 2.1287 3.9382 13.4249 21.8053 25.6398
frequency: 13.2641 21.6183 25.6108 35.6761 68.6275 85.0078 95.3486 131.7154 148.5238 183.7268 209.9474 219.5747 234.8688 241.4845 259.1411 264.4076 290.3967 317.2182 338.5210 386.7296 403.0568 413.6952 417.7238 442.1200 457.8777 505.5480 512.1516 551.4543 576.7155 616.8616 631.6266 648.5317 694.4535 702.4238 721.5616 737.2018 752.8647 805.0625 816.0640 822.1447 832.2369 852.2381 861.6272 916.9740 930.5369 943.1185 964.3286 975.4411 988.4998 990.5445 993.4641 994.1098 997.5614 1004.6612 1028.0731 1048.6977 1060.8078 1086.9875 1110.4082 1112.1618 1135.3639 1155.6598 1156.2823 1163.3469 1170.8509 1174.5564 1188.3884 1200.7422 1217.9478 1221.0805 1232.6278 1271.5016 1292.9866 1303.4971 1322.6074 1337.8742 1344.1118 1380.4525 1383.1080 1387.7828 1398.9514 1416.0053 1437.0301 1437.1378 1463.1797 1467.3667 1471.2615 1473.5178 1476.7841 1485.3874 1488.3594 1503.4038 1585.8160 1592.9758 1615.4367 1624.1212 2764.4919 2862.2341 2905.9074 2957.8327 2990.8650 3006.9983 3044.7063 3084.0398 3099.1420 3119.4018 3121.7633 3123.6569 3130.6669 3137.5695 3146.7797 3159.1330 3160.5810 3166.3015 3175.5466 3407.6612 3558.6683
redmass: 4.3077 4.0578 3.7440 4.8331 4.0326 3.1982 3.5754 3.3130 4.1524 3.5375 3.8946 3.3286 1.5148 2.1229 1.2056 2.8186 1.3299 2.6035 3.0265 4.7893 2.8460 3.2019 3.3758 4.4254 3.2861 3.6308 2.7730 4.0441 3.4229 6.3995 6.8170 3.7135 1.7383 1.8326 2.1769 3.8321 2.3479 2.9326 2.1208 1.7146 1.7020 1.2570 2.4242 1.6098 1.8426 1.3543 1.3535 1.3914 7.6507 5.5656 1.9778 3.2884 1.5287 2.4852 2.2323 2.0739 1.7814 1.6714 1.3402 1.2603 1.8445 1.5698 1.4031 2.5927 1.0587 1.1926 1.1330 1.3743 1.9830 1.4098 4.0256 1.4581 1.1600 1.2756 1.2838 1.4274 1.7222 1.4507 3.7393 3.3921 1.6903 3.2126 1.1986 2.0957 1.2544 1.0501 1.0675 1.0770 1.0575 2.2388 1.1439 2.2633 7.1529 6.2637 6.0876 6.4134 1.0798 1.0721 1.0835 1.0331 1.0365 1.0846 1.1038 1.0993 1.1003 1.0845 1.0895 1.0991 1.0890 1.0878 1.0938 1.0983 1.0950 1.0952 1.0957 1.0738 1.0657
irintensity: 0.3659 0.3138 1.0448 0.2848 2.4435 5.1272 3.3563 0.7292 0.3672 0.4393 0.4158 0.2492 1.9955 19.9569 1.2252 5.1492 114.2191 45.0139 1.7775 0.8826 1.4360 4.2998 2.0041 5.3261 1.0145 4.1192 20.9301 24.7911 12.5933 0.4525 2.7955 16.5603 65.8676 43.3878 22.8890 25.1027 41.7493 5.2745 30.4802 3.5309 46.2049 0.7159 10.0159 6.6009 7.9464 0.9277 0.5456 0.8000 33.4513 0.6788 2.8058 55.7643 5.6485 18.7668 6.5540 31.3670 5.8221 2.9424 13.2171 0.3034 15.4460 73.8406 7.4252 57.8713 0.6490 49.5543 5.8912 24.2413 33.0425 5.9326 156.9222 5.2000 9.6072 5.2056 8.1440 37.0554 10.4234 30.4569 6.6465 9.3465 12.8232 0.1653 16.1347 6.9015 53.5435 13.3021 9.1375 51.5034 16.8334 14.0751 20.7665 100.7306 7.9183 0.3527 4.0650 49.6282 166.8072 102.9476 63.6285 63.5081 13.5508 24.4776 50.5659 36.1244 20.5032 0.0768 16.2224 28.8044 14.3266 6.6082 39.8895 22.7485 13.8361 5.7578 6.7995 1.4376 4.1058
temp: 298.150 k
press: 1.00000 atm
elementType: 8 8 7 6 6 6 6 6 6 6 6 6 6 6 6 6 6 6 6 6 1 1 1 1 1 1 1 1 1 1 1 1 1 1 1 1 1 1 1 1 1
symmnumber: 1
zpe: 894773.7 jmol-1
zpe.correction: 0.340801 hartree
zpe.thermalcorrener: 0.360540 hartree
zpe.thermalcorrenthalpy: 0.361484 hartree
zpe.thermalcorrgfe: 0.289643 hartree
zpe.sumelectzpe: -864.087480 hartree
zpe.sumelectthermal: -864.067741 hartree
zpe.sumelectthermalent: -864.066797 hartree
zpe.sumelectthermalfe: -864.138639 hartree
dipole: -1.6894 -0.2371 -0.1779
dipole: 1.7152
quadrupole: -127.2967 -99.5974 -122.6329
quadrupole: -12.0330 4.4372 3.4911
quadrupole: -10.7877 16.9116 -6.1239 -12.0330 4.4372 3.4911
hfenergy: -864.4282812 hartree
pointgroup: C01 [X(C17H21N1O2)]
dipole: -0.6622204 -0.0917063 -0.0916846 debye
polarizability: 256.2325414|-11.8418772|214.8213232|23.9284414|15.0742349|118.1873405 unknown
InChI: InChI=1S/C17H21NO2/c1-13(17(19)15-6-4-3-5-7-15)18-12-14-8-10-16(20-2)11-9-14/h3-11,13,17-19H,12H2,1-2H3
charge 0 multiplicity 1
41 atoms
O  3.900485 -1.828064 -1.148675
O  -5.845743 0.704737 -0.342742
N  0.345774 -1.20574 -0.15854
C  1.687172 -1.81714 -0.026911
C  2.698402 -1.011114 -0.917168
C  2.148092 -1.902331 1.439214
C  3.156049 0.315742 -0.322451
C  -0.76126 -1.865093 0.577745
C  -2.08623 -1.160885 0.317577
C  2.263673 1.416767 -0.272109
C  4.466959 0.468165 0.191398
C  -3.250573 -1.89531 -0.025847
C  -2.191598 0.246084 0.436166
C  2.673645 2.646176 0.290476
C  4.877185 1.69941 0.751751
C  3.982841 2.792833 0.80582
C  -4.484467 -1.250503 -0.237267
C  -3.419279 0.912081 0.224939
C  -4.572229 0.157769 -0.111392
C  -5.989897 2.156479 -0.219954
H  1.690562 -2.865166 -0.444133
H  2.19134 -0.816715 -1.89188
H  0.087887 -1.079567 -1.148962
H  3.218814 -2.170696 1.47278
H  2.016185 -0.928848 1.94182
H  1.588835 -2.672351 1.999401
H  -0.520677 -1.820729 1.657063
H  -0.864525 -2.949234 0.320978
H  1.244222 1.302901 -0.655594
H  5.157759 -0.376795 0.128672
H  3.616972 -2.720437 -1.47206
H  -3.192632 -2.986025 -0.128274
H  -1.294492 0.82055 0.692846
H  1.974102 3.489571 0.322739
H  5.896435 1.805562 1.141068
H  4.302563 3.748333 1.237445
H  -5.386156 -1.811172 -0.501851
H  -3.465909 2.000749 0.326419
H  -5.747616 2.501028 0.804475
H  -7.04871 2.359614 -0.437983
H  -5.35036 2.689865 -0.9504
