program: Gaussian 09
title: 000287146
version: EM64L-G09RevD.01
frameworkgroup: C1[X(C18H17FN4O2)]
method: RPBEPBE
basis: SDD
operation: Freq
keyword: #p
keyword: freq=noraman
keyword: PBEPBE/SDD
title: #p freq=noraman PBEPBE/SDD
converged: YES YES NO NO
title: Mulliken charges:
elementType: F O O N N N N C C C C C C C C C C C C C C C C C C H H H H H H H H H H H H H H H H H
charge: -0.209961 -0.294733 -0.297990 -0.131403 -0.249245 -0.445040 -0.503400 0.351577 0.037518 0.057346 0.455129 -0.654309 -0.801568 -0.360460 -0.385121 0.257655 -0.214354 -0.209929 -0.249212 0.527208 -0.476313 -0.481096 0.354696 -0.152634 -0.407369 0.255692 0.269162 0.240378 0.234103 0.233717 0.334840 0.329634 0.282009 0.265932 0.230402 0.229966 0.232194 0.304521 0.330335 0.222407 0.231271 0.256444
chargesum: 0.00000
title: Mulliken charges with hydrogens summed into heavy atoms:
elementType: F O O N N N N C C C C C C C C C C C C C C C C C C
charge: -0.209961 -0.294733 -0.297990 -0.131403 -0.249245 -0.115406 -0.198879 0.351577 0.037518 0.057346 0.455129 0.110924 0.001092 -0.078451 -0.119189 0.257655 0.016048 0.020036 -0.017018 0.527208 -0.145978 -0.258689 0.354696 0.078637 -0.150926
polarizability: 4.12517727e+02 -4.25907511e+00 2.41079448e+02 -8.30394967e+00 1.46488962e+01 1.16845592e+02
1716.lowfreq: -1.6405 -0.0002 0.0005 0.0008 3.3024 6.6838 10.7036 25.1452 44.6003
frequency: 10.2576 24.9873 44.5937 49.7285 58.5100 69.4707 88.5246 92.5548 135.9752 158.1142 160.0168 190.4778 194.5983 216.7841 224.8414 236.9270 238.9474 255.6825 284.3048 293.9437 313.0661 355.5184 367.1869 396.2041 408.6568 421.9579 432.0087 447.6849 499.3253 503.3926 526.7315 535.3891 563.8305 593.9686 602.3946 614.5185 621.2598 643.4967 682.6893 683.0602 694.0315 698.5219 715.8849 726.8240 737.5763 759.9413 778.9469 791.5214 828.6636 845.2939 865.0641 904.8623 910.2338 918.5693 953.9873 955.9670 973.3887 982.1740 986.4388 992.6223 1001.1290 1020.3780 1035.8923 1053.5019 1064.4448 1083.1830 1087.8807 1103.4149 1125.0482 1132.2971 1167.6960 1173.5126 1181.6200 1187.4133 1194.1912 1246.2432 1266.3168 1276.5058 1292.1422 1321.0742 1345.4920 1358.2658 1386.0025 1394.2871 1407.3384 1432.6495 1435.7794 1445.9943 1462.3394 1473.1803 1479.9635 1485.4577 1487.6409 1496.6405 1518.4537 1540.0536 1589.0830 1599.9517 1603.3305 1614.4963 1624.8923 1648.7212 1672.6187 2971.1084 2972.4912 3049.5821 3088.8657 3111.5348 3121.6989 3130.8877 3131.4391 3141.5239 3155.1562 3155.3016 3167.4815 3185.9642 3187.1924 3203.3554 3384.2534 3531.3166
redmass: 6.6923 5.3090 6.2933 7.9785 3.9475 5.6348 4.2462 5.6938 4.0700 4.1940 4.3970 1.2024 3.9070 1.5471 5.2596 3.6605 2.9543 4.5243 5.7655 3.7795 4.4251 4.2166 5.4279 5.2879 2.9510 5.1996 5.0197 2.9366 3.4358 8.9147 1.6011 5.3257 4.4602 5.7386 4.2831 6.3230 5.6284 5.9778 4.8580 2.2593 4.8121 2.3073 6.7933 1.4317 5.9960 1.7180 1.5152 5.1511 5.9032 1.2734 1.4456 1.4255 2.3775 1.6311 3.9955 1.3187 1.3686 6.0303 4.8685 1.3906 3.9279 3.3579 1.9671 1.4469 2.6617 1.6117 1.5893 1.6564 2.0424 1.9552 2.1467 1.0515 1.3855 1.1798 2.9283 2.8602 2.8349 1.6201 2.7165 1.4309 3.7174 4.2103 8.8252 6.3352 1.3138 1.2008 3.0851 2.2005 1.0732 1.1069 2.5892 1.5665 1.3950 1.0644 2.2379 2.1401 6.6780 7.4417 6.1293 6.7527 6.7445 3.9502 8.0623 1.0411 1.0424 1.0961 1.0898 1.0978 1.0891 1.0938 1.0927 1.0893 1.0941 1.0926 1.0993 1.0971 1.0966 1.0931 1.0757 1.0763
irintensity: 2.0762 3.7115 1.0373 0.6496 4.4072 7.3767 0.4520 0.9067 2.8692 14.6288 1.5572 0.7738 5.6389 1.9704 0.0892 1.4596 1.1889 0.4269 2.8616 22.4949 2.6779 15.2530 8.3521 4.2561 0.7764 4.9782 8.9912 10.6939 12.4778 4.9673 9.7870 29.8269 24.1558 5.4714 0.9505 1.9560 17.0978 18.4834 18.2850 14.3745 0.7027 38.4877 22.1397 135.0827 11.9612 75.3315 93.4220 10.5734 4.0816 0.5015 1.2965 49.9731 9.8303 7.6847 40.1714 1.6116 0.6626 1.2514 0.0863 0.5355 8.7543 59.4829 1.9818 4.0600 10.8193 2.3436 27.9681 47.7723 10.0333 51.1988 19.7731 0.2153 9.7960 5.0422 2.2965 182.1171 267.0410 11.4486 115.4148 58.8687 16.0061 391.5159 0.8778 104.7200 45.9934 2.1424 148.0301 23.2125 3.2279 128.3004 132.2920 109.6229 80.1536 22.1466 814.1872 556.1525 59.9077 240.0441 11.7646 140.1281 156.3989 60.3125 79.9672 10.0931 110.8511 20.5410 14.2096 19.6302 13.3301 9.0560 2.4926 11.5187 23.0718 17.3077 20.9999 3.3285 1.7999 21.2432 134.0826 14.6273
temp: 298.150 k
press: 1.00000 atm
elementType: 9 8 8 7 7 7 7 6 6 6 6 6 6 6 6 6 6 6 6 6 6 6 6 6 6 1 1 1 1 1 1 1 1 1 1 1 1 1 1 1 1 1
symmnumber: 1
zpe: 846165.1 jmol-1
zpe.correction: 0.322287 hartree
zpe.thermalcorrener: 0.344736 hartree
zpe.thermalcorrenthalpy: 0.345680 hartree
zpe.thermalcorrgfe: 0.268418 hartree
zpe.sumelectzpe: -1163.643588 hartree
zpe.sumelectthermal: -1163.621139 hartree
zpe.sumelectthermalent: -1163.620195 hartree
zpe.sumelectthermalfe: -1163.697458 hartree
dipole: -4.2899 -0.3687 -0.9836
dipole: 4.4166
quadrupole: -135.5970 -134.9290 -147.5815
quadrupole: -28.8274 -1.6109 0.3963
quadrupole: 3.7722 4.4402 -8.2124 -28.8274 -1.6109 0.3963
hfenergy: -1163.9658752 hartree
pointgroup: C01 [X(C18H17F1N4O2)]
dipole: 1.6280402 -0.5930045 0.1310299 debye
polarizability: 410.6284999|-18.0683776|207.1405572|-7.5232433|58.9409471|152.6737093 unknown
InChI: InChI=1S/C18H17FN4O2/c1-12-16(21-18(25)20-14-8-6-7-13(19)11-14)17(24)23(22(12)2)15-9-4-3-5-10-15/h3-11,20-21H,1-2H3
charge 0 multiplicity 1
42 atoms
F  -6.610696 2.836645 1.091131
O  1.440201 -1.608417 -1.09254
O  -1.941123 1.678476 0.847331
N  2.731174 1.076104 0.863424
N  2.922683 -0.127886 0.107619
N  -0.639959 -0.002765 -0.161374
N  -2.944319 -0.025696 -0.443082
C  1.322208 1.293655 0.967784
C  0.673318 0.3104 0.232423
C  1.668779 -0.613956 -0.326125
C  4.198851 -0.459477 -0.442583
C  3.574035 1.193876 2.081688
C  0.835061 2.440801 1.804045
C  4.481427 -1.814538 -0.749567
C  5.160824 0.551015 -0.699083
C  -1.843144 0.632442 0.138045
C  5.733599 -2.149706 -1.30565
C  6.415425 0.19603 -1.23861
C  6.709377 -1.153262 -1.54313
C  -4.313255 0.335706 -0.363119
C  -4.775625 1.464689 0.363774
C  -5.247168 -0.490879 -1.051278
C  -6.155388 1.713843 0.367357
C  -6.623803 -0.194849 -1.014249
C  -7.107657 0.923659 -0.297364
H  3.436185 2.202453 2.499213
H  4.63311 1.069342 1.810714
H  3.302673 0.437187 2.84446
H  0.998009 2.25754 2.884112
H  1.36087 3.375735 1.536098
H  -0.244962 2.568883 1.64183
H  -0.628879 -0.834359 -0.77272
H  3.720033 -2.577781 -0.572634
H  4.909561 1.599695 -0.509449
H  5.948128 -3.196037 -1.548657
H  7.156571 0.978234 -1.436443
H  7.682211 -1.423504 -1.96727
H  -2.755646 -0.867981 -0.990587
H  -4.078097 2.110981 0.897761
H  -4.893538 -1.363523 -1.614354
H  -7.328542 -0.840131 -1.548597
H  -8.170109 1.175564 -0.252545
