program: Gaussian 09
title: 000287079
version: EM64L-G09RevD.01
frameworkgroup: C1[X(C9H9ClN2O5S)]
method: RPBEPBE
basis: SDD
operation: Freq
keyword: #p
keyword: freq=noraman
keyword: PBEPBE/SDD
title: #p freq=noraman PBEPBE/SDD
converged: YES YES NO NO
title: Mulliken charges:
elementType: Cl S O O O O O N N C C C C C C C C C H H H H H H H H H
charge: -0.026033 0.677918 -0.597320 -0.416006 -0.222219 -0.196122 -0.198749 -0.569445 0.022583 -0.665281 -0.163218 -0.069264 -0.077369 -0.155343 0.150506 0.411945 -0.355791 -0.375181 0.286815 0.306455 0.335264 0.309567 0.290780 0.297105 0.314323 0.295624 0.388454
chargesum: 0.00000
title: Mulliken charges with hydrogens summed into heavy atoms:
elementType: Cl S O O O O O N N C C C C C C C C C
charge: -0.026033 0.677918 -0.597320 -0.027552 -0.222219 -0.196122 -0.198749 0.018440 0.022583 -0.072010 0.172046 -0.069264 -0.077369 0.154224 0.150506 0.411945 -0.041468 -0.079556
polarizability: 2.48586642e+02 -2.00197458e+01 1.47395821e+02 -1.03952518e+01 -1.85634838e+01 1.29532886e+02
1716.lowfreq: -10.2302 -1.4857 -0.0022 -0.0017 0.0009 5.1857 23.5392 34.7987 38.0200
frequency: 23.4177 34.7801 37.9887 52.1453 58.8061 79.1648 113.8428 140.0114 157.9811 161.6275 164.5705 172.9452 220.4258 234.2909 280.8718 294.2586 321.0951 346.0801 363.3675 400.9717 427.4092 452.4638 467.7334 486.6938 508.3714 525.2820 530.0902 578.5006 614.1129 648.3569 658.5412 689.6971 703.6520 706.0481 727.2908 792.7094 816.3884 843.2681 859.2046 875.7125 922.6815 986.0802 993.2097 1011.6163 1037.7798 1066.7139 1088.3654 1104.9569 1128.1778 1170.4070 1191.4949 1207.5206 1230.4548 1239.8228 1272.0541 1293.6919 1360.6002 1391.7055 1395.6329 1405.8653 1409.6474 1430.9313 1578.3710 1589.0956 1655.3740 1658.8269 2849.0448 3059.8256 3117.0119 3160.0501 3185.0511 3188.3707 3469.1856 3513.4439 3594.3730
redmass: 8.4791 11.7201 5.5164 9.7846 8.5454 6.1172 7.7273 9.3158 2.7470 14.5761 3.2001 2.0165 4.6037 12.2786 5.5263 4.7028 8.8967 9.3945 4.4716 4.5274 8.5275 3.7619 4.3331 6.1016 5.6837 5.5335 6.0800 2.0039 1.6545 7.2866 1.6533 7.0227 4.2797 10.7724 3.6410 14.6048 9.4121 4.1902 1.7432 1.4179 1.5044 2.5568 5.9511 1.3353 2.4563 1.6479 1.1751 7.1127 1.2654 2.3236 1.3029 5.7924 1.5170 1.4846 1.5498 1.5871 5.4894 6.4842 1.3117 1.1403 8.1218 2.5030 6.9092 9.2555 1.3612 3.4198 1.0813 1.0559 1.0911 1.1108 1.0931 1.0942 1.0464 1.0643 1.0970
irintensity: 0.2786 0.5450 0.1930 1.3163 1.0116 6.2009 2.0956 2.5798 16.8331 2.1021 2.9327 6.0971 0.1553 2.1093 0.9571 0.9647 8.8199 12.6783 13.3505 27.6798 0.5990 14.6273 18.9158 4.6762 4.7748 1.3490 1.5390 55.2973 89.5035 9.3392 206.4506 11.4988 20.8328 37.4118 21.2031 40.1416 25.9035 2.7500 22.9048 30.1043 32.0618 48.0083 11.5353 1.2409 267.5876 16.1331 6.1504 29.2838 6.1211 9.1913 44.8963 326.2444 82.5190 1.8661 5.5637 90.1248 18.3723 94.3037 3.6206 17.3404 44.0988 39.4583 32.7186 10.1199 175.4220 142.7650 87.7387 2.2506 12.0998 0.4696 9.3313 2.2945 5.2242 25.1978 11.3466
temp: 298.150 k
press: 1.00000 atm
elementType: 17 16 8 8 8 8 8 7 7 6 6 6 6 6 6 6 6 6 1 1 1 1 1 1 1 1 1
symmnumber: 1
zpe: 469699.4 jmol-1
zpe.correction: 0.178899 hartree
zpe.thermalcorrener: 0.197430 hartree
zpe.thermalcorrenthalpy: 0.198374 hartree
zpe.thermalcorrgfe: 0.129622 hartree
zpe.sumelectzpe: -1690.602720 hartree
zpe.sumelectthermal: -1690.584189 hartree
zpe.sumelectthermalent: -1690.583245 hartree
zpe.sumelectthermalfe: -1690.651997 hartree
dipole: -4.0476 1.4928 -0.8361
dipole: 4.3944
quadrupole: -132.1899 -117.4008 -127.8434
quadrupole: 1.8256 8.0011 -4.6382
quadrupole: -6.3786 8.4106 -2.0320 1.8256 8.0011 -4.6382
hfenergy: -1690.7816192 hartree
pointgroup: C01 [X(C9H9Cl1N2O5S1)]
dipole: -1.5517774 -0.7137969 -0.2674899 debye
polarizability: 240.8438147|12.430801|159.6030772|35.6332341|4.3020615|125.0684584 unknown
InChI: InChI=1S/C9H9ClN2O5S/c10-6-3-5(12(15)16)1-2-8(6)18(17)4-7(11)9(13)14/h1-3,7,13H,4,11H2
charge 0 multiplicity 1
27 atoms
Cl 0.622556 -2.841737 -0.69195
S  -1.130694 -0.233696 -1.87788
O  -1.608934 1.357447 -2.091894
O  -5.219638 -0.16806 -0.326855
O  -4.752067 0.220377 1.918178
O  4.369654 1.823567 1.641729
O  4.653769 -0.432216 1.840551
N  -1.992092 0.713908 1.325977
N  4.006431 0.604639 1.425921
C  -2.431434 -0.880271 -0.515958
C  -2.913133 0.354667 0.252388
C  0.420787 -0.046376 -0.783962
C  1.1745 -1.139883 -0.330875
C  0.846423 1.270946 -0.542075
C  -4.359735 0.137699 0.735549
C  2.758159 0.381627 0.650093
C  2.355216 -0.949583 0.404474
C  2.029026 1.498765 0.184881
H  -1.884215 -1.610643 0.096359
H  -3.212441 -1.347903 -1.135257
H  -2.926425 1.186565 -0.498575
H  0.222432 2.083988 -0.936219
H  -2.139756 0.192029 2.196455
H  -1.919267 1.720006 1.495608
H  2.954519 -1.783751 0.777427
H  2.39356 2.506361 0.398203
H  -6.149101 -0.277672 0.012504
