program: Gaussian 09
title: 000287060
version: EM64L-G09RevD.01
frameworkgroup: C1[X(C8H7NO3)]
method: RPBEPBE
basis: SDD
operation: Freq
keyword: #pfreq=noraman
keyword: PBEPBE/SDD
title: #p freq=noraman PBEPBE/SDD
converged: NO YES NO NO
title: Mulliken charges:
elementType: O O O N C C C C C C C C H H H H H H H
charge: -0.321570 -0.262634 -0.278786 -0.650202 0.099548 0.205218 0.196143 -0.185698 -0.339745 -0.370942 -0.195471 0.147459 0.241910 0.241908 0.256263 0.282753 0.235864 0.366366 0.331615
chargesum: 0.00000
title: Mulliken charges with hydrogens summed into heavy atoms:
elementType: O O O N C C C C C C C C
charge: -0.321570 -0.262634 -0.278786 0.047778 0.099548 0.205218 0.196143 0.298121 -0.083482 -0.088189 0.040393 0.147459
polarizability: 1.27258702e+02 -4.65323134e+00 1.25856719e+02 -2.26943933e-03 1.76199147e-03 4.51807669e+01
1716.lowfreq: -52.4457 -3.4813 -0.0010 -0.0007 -0.0007 3.6503 7.3266 74.9742 120.8549
frequency: -52.2857 74.9678 120.8543 186.8811 227.0644 251.6413 348.3614 371.8168 443.7024 467.4752 541.1848 545.1515 598.6236 620.7736 621.0598 641.2084 700.0728 707.1606 743.3156 801.2067 804.8418 846.7796 911.2590 919.4565 981.4111 985.0335 1044.1330 1066.4562 1083.5223 1108.5036 1121.2409 1158.8476 1210.6461 1243.1030 1350.1900 1369.3023 1412.2222 1433.8728 1462.1367 1486.0255 1582.4964 1605.5812 1634.3287 1640.5456 3014.5209 3093.3144 3150.4808 3168.9593 3186.5903 3483.7392 3653.8332
redmass: 2.3942 6.6240 7.0306 5.7623 5.4420 6.0860 8.2678 4.9066 3.5106 6.2518 4.6888 3.7827 1.3266 6.4924 1.1378 4.9411 4.9821 10.2014 2.5559 1.8167 5.9767 11.9097 1.3748 5.6919 1.3150 7.1444 1.9830 1.4503 2.9116 2.5030 1.0375 1.2687 1.9223 2.3888 2.4145 1.4518 5.0231 4.7168 3.0536 1.1109 4.6183 2.5656 2.1320 7.7046 1.0534 1.1191 1.0872 1.0940 1.0976 1.0476 1.1030
irintensity: 11.5059 12.3364 0.5262 7.7922 0.6863 2.0720 6.1719 12.0397 0.9521 1.5503 9.2107 6.5604 75.9018 0.6836 195.9646 8.0109 4.2867 1.5860 80.9806 36.5097 18.9822 31.8293 0.0002 8.4237 2.8497 121.1620 46.4749 4.4398 4.6862 0.1285 0.0102 7.3311 59.9456 110.2878 160.6184 25.6602 42.9152 104.3499 12.4760 0.7983 139.5552 86.2731 246.3179 2.6932 101.1136 29.7152 5.5734 4.6134 6.5578 44.0944 67.8372
temp: 298.150 k
press: 1.00000 atm
elementType: 8 8 8 7 6 6 6 6 6 6 6 6 1 1 1 1 1 1 1
symmnumber: 1
zpe: 366212.2 jmol-1
zpe.correction: 0.139483 hartree
zpe.thermalcorrener: 0.148542 hartree
zpe.thermalcorrenthalpy: 0.149486 hartree
zpe.thermalcorrgfe: 0.104919 hartree
zpe.sumelectzpe: -588.607729 hartree
zpe.sumelectthermal: -588.598669 hartree
zpe.sumelectthermalent: -588.597725 hartree
zpe.sumelectthermalfe: -588.642292 hartree
dipole: 3.6981 -2.6343 -0.0013
dipole: 4.5404
quadrupole: -79.0654 -52.9735 -71.1029
quadrupole: 3.0081 0.0056 0.0110
quadrupole: -11.3515 14.7405 -3.3890 3.0081 0.0056 0.0110
hfenergy: -588.7472115 hartree
pointgroup: C01 [X(C8H7N1O3)]
dipole: 1.3978015 1.1122714 0.0011417 debye
dipolederiv: -0.72104 -0.2781485 -0.0001998 -0.4578057 -1.1417555 -0.0000696 -0.0000966 -0.0000293 -0.2534531 -0.7690694 -0.4349137 -0.0002624 -0.4223644 -0.9834521 -0.0001024 -0.0003653 -0.0003372 -0.2479352 -1.0692517 -0.2545952 -0.0010719 -0.0682817 -0.7024113 -0.000719 0.0006898 0.0005684 -0.3761681 -0.4182112 0.1288004 -0.0002029 0.1501503 -1.1158168 0.0004305 -0.0004371 -0.0002031 -0.6894713 -0.0298483 -0.1863309 0.0001036 0.5419902 0.9031553 0.0001423 -0.0004521 -0.0000922 0.0093426 0.6512113 0.8175581 0.0002721 0.3904426 0.3046959 0.0003231 0.0004893 0.0006753 0.0519651 -0.4438532 0.1267088 -0.0000984 0.1896117 -0.0932899 -0.0000067 -0.0006935 0.0002734 0.0239369 0.7709827 0.2573399 -0.0000237 0.3115597 0.9898213 -0.0000467 0.0000197 -0.0000778 0.5787128 0.027493 0.0102862 0.0001554 -0.1056704 -0.0092638 -0.0001409 0.0001452 0.0000014 -0.1655137 -0.0263108 0.0949136 0.0001741 -0.1718063 -0.0835019 -0.000068 -0.0001205 0.0001426 -0.1435633 -0.112259 -0.1093656 0.0000935 0.0476767 0.0987973 -0.0000201 0.0000248 -0.0001931 -0.1671674 1.5137494 0.0138933 0.0010303 -0.2220126 1.4519152 0.0011638 0.0005736 0.0003221 0.2401195 0.0201527 -0.0561201 -0.0246145 -0.0716889 -0.0544056 -0.0573522 -0.0767908 -0.1367399 -0.0658771 0.0199569 -0.0562843 0.0247799 -0.0717183 -0.0543067 0.0572428 0.077008 0.1367629 -0.0659666 -0.021501 0.0595957 -0.000157 0.0541088 0.0845119 0.0000431 -0.00018 0.0000769 0.1811421 0.0695461 -0.0794711 -0.0001141 -0.0457334 0.0934194 -0.0000328 -0.0000914 -0.0000042 0.164473 0.0811762 0.0037276 -0.0000456 0.0165681 -0.1057061 0.000025 0.0000073 0.0000457 0.1658406 0.3048025 -0.0402195 0.0001605 -0.0536869 0.2173677 -0.000417 0.0000564 -0.0007 0.3814564 0.1522739 -0.0173747 0.000021 -0.0113395 0.2002256 -0.0003952 0.0002134 -0.0004919 0.3781269 unknown
polarizability: 126.7609107|4.7013421|126.3544976|0.03215|0.0113761|45.1807806 unknown
InChI: InChI=1S/C8H7NO3/c9-8(10)5-2-1-3-6-7(5)12-4-11-6/h1-3H,4,9H2
charge 0 multiplicity 1
19 atoms
O  0.568052 1.781671 -0.000766
O  2.674833 0.639673 0.000954
O  -3.284751 -0.373946 -0.001235
N  -2.252146 1.708054 -0.00029
C  0.36351 0.372322 -0.000814
C  1.604316 -0.293899 0.00018
C  -0.859945 -0.315595 -0.001716
C  2.048008 1.980272 0.000029
C  1.699016 -1.686202 0.000395
C  -0.77134 -1.739945 -0.001456
C  0.46942 -2.406345 -0.000472
C  -2.224084 0.325196 -0.00299
H  2.332164 2.518859 0.920352
H  2.333264 2.518105 -0.920406
H  2.667771 -2.191728 0.001185
H  -1.718615 -2.288396 -0.002187
H  0.496376 -3.500329 -0.000352
H  -1.397477 2.268369 0.00078
H  -3.16537 2.160164 0.001108
