program: Gaussian 09
title: 000287108
version: EM64L-G09RevD.01
frameworkgroup: C1[X(C15H13FN2O2S)]
method: RPBEPBE
basis: SDD
operation: Freq
keyword: #p
keyword: freq=noraman
keyword: PBEPBE/SDD
title: #p freq=noraman PBEPBE/SDD
converged: NO YES NO NO
title: Mulliken charges:
elementType: S F O O N N C C C C C C C C C C C C C C C H H H H H H H H H H H H H
charge: 0.965479 -0.157828 -0.510205 -0.504116 -0.273840 -0.010947 -0.104893 0.151086 -0.675570 -0.227931 -0.236856 0.445567 0.323347 -0.257153 -0.359288 -0.382367 -0.503070 -0.402337 0.438315 -0.796418 -0.249901 0.269863 0.217201 0.264916 0.286478 0.290522 0.245446 0.248871 0.248126 0.286390 0.259899 0.230871 0.232139 0.248205
chargesum: 0.00000
title: Mulliken charges with hydrogens summed into heavy atoms:
elementType: S F O O N N C C C C C C C C C C C C C C C
charge: 0.965479 -0.157828 -0.510205 -0.504116 -0.273840 -0.010947 -0.104893 0.151086 0.076410 0.058546 0.053666 0.445567 0.323347 -0.011708 -0.110417 -0.134241 -0.216680 -0.142438 0.438315 -0.085203 -0.249901
polarizability: 3.26455785e+02 3.67269001e+01 2.26451061e+02 -2.39424492e+01 -3.35905841e+00 1.44816035e+02
1716.lowfreq: -11.3296 -9.2765 -8.2418 0.0012 0.0014 0.0022 3.5794 6.7150 35.2215
frequency: -4.6171 4.9387 35.2100 47.9822 58.2714 73.6607 104.0677 123.8043 131.0878 140.1861 158.9332 183.9423 196.6404 211.3350 231.1567 241.3779 267.2837 285.3295 298.3096 323.3449 343.7181 378.8250 397.6124 409.0070 417.7124 426.9851 460.6845 473.7298 490.2521 507.2792 525.4188 577.9740 602.8183 620.4197 635.3957 675.3456 707.3044 728.4131 742.2717 775.5281 814.2591 827.3978 830.1969 852.9087 893.1423 925.7647 957.8249 959.7758 966.3434 983.9149 989.2665 991.6894 1014.5835 1047.0735 1048.8641 1083.7536 1114.9900 1119.9670 1129.9155 1161.3588 1185.6367 1218.4412 1222.2919 1269.5230 1284.6963 1297.1289 1359.7285 1379.5829 1390.9380 1398.9987 1416.9260 1421.2058 1453.6601 1469.8917 1470.2551 1472.7016 1478.7277 1487.9615 1541.7996 1590.1030 1592.1153 1606.2587 2176.6243 2935.7307 2982.4642 3047.7450 3064.9834 3093.3054 3093.7542 3136.5897 3137.9638 3151.2554 3160.0292 3164.3184 3172.4926 3182.1977
redmass: 1.0156 6.2258 6.9251 5.0562 4.8894 5.1460 7.7504 4.7619 5.6954 7.3060 6.9599 7.3981 7.0598 8.1145 8.1187 1.4259 2.1826 4.0361 4.6107 6.5024 5.0598 4.0501 7.9950 2.9049 8.9620 9.7021 4.3892 5.3965 5.3047 3.3755 8.2775 5.9310 5.7098 6.9578 4.2723 7.0682 3.3702 4.5938 4.0006 4.8117 12.0696 1.4289 1.4241 1.2404 1.5129 4.6640 1.3955 9.2622 1.3030 1.4446 2.1743 2.3684 7.2399 2.4440 1.5988 1.3537 2.0686 1.2989 1.5459 1.5652 1.1363 3.0425 2.2022 1.6673 4.9855 1.2641 6.7748 5.8487 3.0263 1.2216 1.5596 2.2344 1.0498 1.3208 1.7048 1.0629 1.9602 1.2689 7.7478 6.8443 5.9303 6.6758 12.6281 1.0441 1.0388 1.0877 1.0950 1.1002 1.1001 1.0890 1.0892 1.0876 1.0957 1.0966 1.0970 1.0940
irintensity: 0.5209 1.1006 0.5305 1.4749 0.3947 1.8331 1.7528 1.4550 0.1421 2.6262 6.0953 0.6798 10.2948 3.6123 3.5390 1.0715 0.0843 4.8638 1.8785 7.7977 1.0853 0.5452 25.6731 0.1025 28.9312 56.9208 5.4651 5.3145 4.6556 83.8255 9.0230 20.1462 2.8549 0.2943 15.7549 2.9816 1.2191 11.8584 3.1760 1.3272 119.7110 39.3193 10.1039 0.7974 33.5955 19.5510 1.3556 53.3365 1.3110 2.6073 3.5404 2.5437 5.7562 27.0246 23.6713 27.6745 25.3993 7.8315 13.5933 0.5280 13.9053 9.3620 21.5781 7.2253 19.4711 2.4097 11.0143 0.2965 10.0615 17.0829 8.2485 23.4149 33.4760 24.9844 17.3741 13.5389 38.6688 34.2841 27.9535 0.1622 13.5079 11.1562 52.9795 40.7576 20.7812 15.3537 15.7356 1.6509 14.1719 10.2329 6.6311 3.9498 4.1711 7.8258 3.4403 0.6231
temp: 298.150 k
press: 1.00000 atm
elementType: 16 9 8 8 7 7 6 6 6 6 6 6 6 6 6 6 6 6 6 6 6 1 1 1 1 1 1 1 1 1 1 1 1 1
symmnumber: 1
zpe: 641405.2 jmol-1
zpe.correction: 0.244298 hartree
zpe.thermalcorrener: 0.264377 hartree
zpe.thermalcorrenthalpy: 0.265321 hartree
zpe.thermalcorrgfe: 0.193201 hartree
zpe.sumelectzpe: -1335.556404 hartree
zpe.sumelectthermal: -1335.536326 hartree
zpe.sumelectthermalent: -1335.535381 hartree
zpe.sumelectthermalfe: -1335.607502 hartree
dipole: -6.7273 4.6462 4.5560
dipole: 9.3596
quadrupole: -134.4657 -145.0525 -127.2715
quadrupole: -23.4713 0.0636 -4.3083
quadrupole: 1.1308 -9.4559 8.3251 -23.4713 0.0636 -4.3083
hfenergy: -1335.8007025 hartree
pointgroup: C01 [X(C15H13F1N2O2S1)]
dipole: 2.411357 -2.030112 1.9035904 debye
polarizability: 334.0677872|24.8354533|218.8251179|21.9619882|-4.0141885|144.8299758 unknown
InChI: InChI=1S/C15H13FN2O2S/c1-11-3-6-13(7-4-11)21(19,20)18(2)15-8-5-12(10-17)9-14(15)16/h3-9H,1-2H3
charge 0 multiplicity 1
34 atoms
S  1.045783 1.735379 -0.653975
F  -2.223446 2.67271 -0.827829
O  2.003992 3.026304 -0.437212
O  0.142161 1.487198 -1.97808
N  -0.239585 1.776581 0.908181
N  -5.880958 -1.987535 -0.398607
C  2.104341 0.188304 -0.401827
C  -1.360638 0.955503 0.665743
C  0.55422 1.583072 2.140194
C  1.618037 -1.036543 -0.891008
C  3.343554 0.326621 0.244539
C  3.687995 -2.09801 -0.063145
C  -2.359423 1.41484 -0.248669
C  -1.608196 -0.290726 1.317009
C  2.425609 -2.180498 -0.711425
C  4.132314 -0.83358 0.408072
C  -3.513043 0.680815 -0.54119
C  -2.769394 -1.035869 1.057439
C  -3.723956 -0.564354 0.112076
C  4.559749 -3.330493 0.0860
C  -4.903972 -1.33635 -0.168797
H  1.366081 2.329934 2.138447
H  0.994959 0.571684 2.274458
H  -0.102942 1.800973 3.000789
H  0.660266 -1.086285 -1.418646
H  3.687031 1.310786 0.579961
H  -0.87903 -0.6692 2.040189
H  2.07403 -3.14773 -1.088301
H  5.10769 -0.75301 0.901134
H  -4.244538 1.082172 -1.247468
H  -2.944017 -1.985692 1.571243
H  5.265631 -3.231784 0.928248
H  3.954736 -4.239567 0.24788
H  5.16016 -3.496648 -0.829222
