program: Gaussian 09
title: 000287143
version: EM64L-G09RevD.01
frameworkgroup: C1[X(C20H22N4O4)]
method: RPBEPBE
basis: SDD
operation: Freq
keyword: #p
keyword: freq=noraman
keyword: PBEPBE/SDD
title: #p freq=noraman PBEPBE/SDD
converged: YES YES NO NO
title: Mulliken charges:
elementType: O O O O N N N N C C C C C C C C C C C C C C C C C C C C H H H H H H H H H H H H H H H H H H H H H H
charge: -0.293358 -0.301066 -0.322368 -0.266354 -0.133689 -0.249882 -0.444527 -0.494364 0.346400 0.043775 0.054413 0.452492 -0.653764 -0.804264 -0.360940 -0.385765 0.239078 -0.215529 -0.211714 0.349464 -0.251043 0.130117 -0.455765 0.357315 -0.311355 -0.395741 -0.526073 -0.536501 0.238662 0.254634 0.267523 0.338222 0.230861 0.231322 0.332275 0.283995 0.266422 0.228699 0.228304 0.342241 0.230443 0.326449 0.235561 0.238444 0.224118 0.223537 0.242938 0.216345 0.216619 0.243396
chargesum: 0.00000
title: Mulliken charges with hydrogens summed into heavy atoms:
elementType: O O O O N N N N C C C C C C C C C C C C C C C C C C C C
charge: -0.293358 -0.301066 -0.322368 -0.266354 -0.133689 -0.249882 -0.112251 -0.152123 0.346400 0.043775 0.054413 0.452492 0.107056 -0.003860 -0.076945 -0.119343 0.239078 0.013169 0.016591 0.349464 -0.020600 0.130117 -0.129316 0.357315 -0.075795 -0.157297 0.164520 0.139859
polarizability: 4.50625401e+02 1.26993134e+01 2.94270442e+02 8.57067680e+00 -1.09946740e+01 1.38222089e+02
1716.lowfreq: -1.3574 -1.2059 0.0005 0.0005 0.0008 5.4191 11.2974 21.1875 37.2071
frequency: 10.7902 21.1507 37.1862 47.4302 56.8290 69.5559 76.5215 84.3045 87.9800 94.3564 129.3790 140.2570 148.9430 156.7340 162.3655 188.8489 196.7674 216.2312 224.9924 237.9610 248.8557 254.6339 256.9837 267.1824 286.5177 297.5595 314.2893 344.7366 365.5682 372.0870 379.5742 401.9862 408.6288 431.3952 448.4308 498.6909 507.0270 541.2627 552.9609 558.8685 594.9940 599.8177 614.9727 622.2004 631.5196 643.4618 679.2482 685.5051 696.0466 698.0703 716.4018 731.1186 745.8891 759.4423 762.6628 774.4220 791.7243 833.9649 843.9888 882.2498 904.4307 913.4578 915.3520 932.9086 972.3939 985.8109 991.6168 994.6836 997.8931 1017.2351 1020.6806 1034.9539 1051.8756 1063.6535 1084.4505 1102.8262 1111.8816 1117.4007 1121.5340 1130.0505 1143.1543 1155.0119 1168.0113 1172.5306 1184.5791 1189.0031 1194.1021 1200.4368 1249.3288 1254.6971 1277.3348 1289.7690 1319.3419 1342.8551 1356.6143 1386.0168 1397.0500 1403.3441 1427.1801 1431.8857 1437.5320 1445.7476 1455.7000 1461.5894 1465.0161 1465.3598 1470.7849 1473.5396 1475.6330 1484.6970 1486.8917 1487.3078 1495.9790 1523.7555 1537.7656 1588.4696 1600.0253 1604.4038 1615.0771 1625.6403 1645.1327 1672.3207 2950.6365 2961.3703 2967.8335 2969.9434 3034.8918 3047.1918 3048.9451 3086.2449 3104.6996 3120.3090 3124.6734 3128.7381 3130.1822 3140.8055 3151.7607 3155.4814 3167.2239 3174.8631 3187.3500 3204.8509 3402.0429 3489.5863
redmass: 4.8584 5.0485 5.3317 5.9653 3.9233 4.4660 4.1371 4.4449 3.8871 4.1294 4.2314 4.4068 4.3849 3.6897 4.1211 1.1413 3.8735 1.3483 1.1021 3.1353 1.5647 2.6876 3.2667 4.8435 3.3885 5.5305 4.0643 3.6527 5.6797 5.7349 5.3822 5.7981 2.9536 4.9772 3.0543 3.5831 5.0760 4.7370 5.5422 4.2695 3.7724 2.2919 6.2928 5.5874 2.0021 5.6660 6.0712 5.1666 5.6487 2.3665 9.5094 2.9417 1.4973 1.8028 3.9565 1.4836 5.1697 5.0554 1.3159 1.3808 3.2578 1.4112 1.4977 4.2353 1.3672 4.5390 1.4270 6.0300 5.3359 3.5295 3.4636 1.9604 1.4487 2.6877 1.6563 1.7061 1.2613 1.2573 2.2783 1.8972 1.6708 1.4247 1.9375 1.0537 1.2370 2.6330 2.6345 2.0736 2.2959 2.5270 2.6244 2.6090 1.4326 3.7578 4.1061 8.7587 5.6073 1.3096 1.4252 1.1748 1.2016 2.2213 2.0302 1.1156 1.0512 1.0501 1.2893 1.1156 1.1351 1.2455 1.6668 1.7965 1.0722 2.5934 2.2109 6.7780 8.7283 6.3252 6.7380 5.7746 4.1160 8.6884 1.0334 1.0327 1.0395 1.0434 1.1036 1.0960 1.1041 1.0898 1.0983 1.0986 1.0997 1.1009 1.0856 1.0894 1.0875 1.0940 1.0992 1.0952 1.0965 1.0925 1.0757 1.0762
irintensity: 0.4788 4.2244 1.1749 3.4700 4.3553 0.0742 7.0844 0.6991 0.1615 1.2548 3.8784 0.7757 15.3774 14.6746 1.6016 0.6572 0.1387 0.5720 0.0179 0.4528 1.1214 0.4769 0.2318 24.9542 3.4389 8.5077 0.7936 7.3715 10.0092 0.5826 0.7146 2.5257 0.7375 16.2054 7.2688 14.6157 20.0575 11.7979 11.6956 22.9178 4.9644 4.9024 1.9170 16.5106 3.8246 20.7804 30.3351 16.9451 3.2295 37.1709 7.4666 23.9854 139.8360 54.1301 28.2820 70.1493 14.5687 6.3937 0.5990 0.3874 1.6720 39.3198 8.4343 1.6259 0.9649 0.5022 0.8358 61.0531 19.8588 57.5317 48.0872 1.9104 2.6509 11.1544 12.0830 41.8669 0.2496 0.1647 61.7989 58.2268 31.2096 3.2672 21.8811 0.4398 26.8829 119.4368 36.6695 56.2422 285.0726 7.0837 360.0713 18.3858 60.1513 34.1235 398.0740 0.8322 24.2642 47.7732 99.9925 9.1117 1.5515 19.9053 154.6136 12.0848 14.3732 12.2017 142.2382 56.4748 51.6889 66.2907 22.2710 179.0229 26.1186 1389.2107 280.7715 55.3386 282.3024 24.3918 136.6232 78.3118 34.0282 82.8628 83.5502 83.3165 24.9835 104.7611 54.7058 22.2415 47.7572 15.4439 23.6948 27.3539 18.2904 11.1883 1.0171 13.6096 11.5706 27.6552 19.9629 12.4110 2.0856 11.4569 110.4110 73.9316
temp: 298.150 k
press: 1.00000 atm
elementType: 8 8 8 8 7 7 7 7 6 6 6 6 6 6 6 6 6 6 6 6 6 6 6 6 6 6 6 6 1 1 1 1 1 1 1 1 1 1 1 1 1 1 1 1 1 1 1 1 1 1
symmnumber: 1
zpe: 1033028.3 jmol-1
zpe.correction: 0.393460 hartree
zpe.thermalcorrener: 0.420415 hartree
zpe.thermalcorrenthalpy: 0.421359 hartree
zpe.thermalcorrgfe: 0.334334 hartree
zpe.sumelectzpe: -1293.176440 hartree
zpe.sumelectthermal: -1293.149485 hartree
zpe.sumelectthermalent: -1293.148541 hartree
zpe.sumelectthermalfe: -1293.235566 hartree
dipole: -0.5886 0.6106 -0.9969
dipole: 1.3089
quadrupole: -108.8863 -146.1175 -166.9471
quadrupole: -24.5773 -2.1675 -0.6287
quadrupole: 31.7640 -5.4672 -26.2968 -24.5773 -2.1675 -0.6287
hfenergy: -1293.5699001 hartree
pointgroup: C01 [X(C20H22N4O4)]
dipole: -0.2558184 -0.3800889 -0.2351183 debye
polarizability: 445.3225189|13.6694234|137.7792545|-29.9672039|-0.2979704|300.0161579 unknown
InChI: InChI=1S/C20H22N4O4/c1-13-18(19(25)24(23(13)2)14-8-6-5-7-9-14)22-20(26)21-16-12-15(27-3)10-11-17(16)28-4/h5-12,21-22H,1-4H3
charge 0 multiplicity 1
50 atoms
O  2.165379 0.16154 -2.070035
O  -1.17415 0.089705 1.792905
O  -3.911604 0.177723 -2.30811
O  -5.812039 0.399027 2.979022
N  3.489093 -0.031728 1.233768
N  3.669409 0.0076 -0.189217
N  0.090171 0.046411 -0.19394
N  -2.222751 0.130843 -0.318841
C  2.080674 -0.108546 1.479719
C  1.416586 -0.029579 0.262647
C  2.404853 0.039279 -0.823241
C  4.914984 0.409742 -0.760025
C  4.389995 -0.974571 1.948044
C  1.613681 -0.273239 2.896695
C  5.214042 0.033134 -2.094441
C  5.83358 1.191872 -0.013165
C  -1.107134 0.088581 0.525801
C  6.437549 0.436935 -2.668454
C  7.060785 1.571587 -0.596727
C  -3.583208 0.212604 0.056431
C  7.371034 1.196116 -1.924299
C  -4.518552 0.240407 -1.030176
C  -4.061553 0.266784 1.379317
C  -5.456727 0.350184 1.617405
C  -5.896104 0.322385 -0.782939
C  -6.380675 0.378774 0.549323
C  -4.789877 0.202139 -3.475271
C  -7.236578 0.484829 3.294778
H  4.177183 -2.029252 1.681846
H  4.246787 -0.832832 3.029756
H  5.437017 -0.743966 1.700149
H  0.525647 -0.114903 2.933572
H  2.113862 0.453282 3.563562
H  1.825748 -1.29004 3.281853
H  0.071485 0.121228 -1.222175
H  4.484759 -0.544051 -2.667481
H  5.566453 1.525212 0.99479
H  6.66319 0.150577 -3.701506
H  7.767097 2.176473 -0.017283
H  -2.090618 0.096549 -1.334995
H  8.322411 1.497821 -2.375195
H  -3.36355 0.243196 2.216736
H  -6.61069 0.343784 -1.611006
H  -7.457803 0.442672 0.723736
H  -5.375007 1.141468 -3.513219
H  -5.47815 -0.665333 -3.473205
H  -4.121673 0.14485 -4.347186
H  -7.78946 -0.398543 2.917449
H  -7.689263 1.407273 2.879326
H  -7.28739 0.510994 4.3934
