program: Gaussian 09
title: 000287062
version: EM64L-G09RevD.01
frameworkgroup: C1[X(C18H19NO3)]
method: RPBEPBE
basis: SDD
operation: Freq
keyword: #p
keyword: freq=noraman
keyword: PBEPBE/SDD
title: #p freq=noraman PBEPBE/SDD
converged: YES YES NO NO
title: Mulliken charges:
elementType: O O O N C C C C C C C C C C C C C C C C C C H H H H H H H H H H H H H H H H H H H
charge: -0.243147 -0.288115 -0.273127 -0.362732 0.007780 0.065682 -0.571826 0.152629 0.426385 0.487195 -0.747647 -0.514389 -0.532329 -0.413098 -0.418312 0.225507 0.200556 -0.231695 -0.249436 -0.246779 -0.535625 -0.499844 0.275607 0.227855 0.228144 0.214418 0.236966 0.255229 0.289621 0.257922 0.273867 0.224091 0.224442 0.223967 0.227693 0.240533 0.229627 0.231882 0.228070 0.220516 0.251918
chargesum: 0.00000
title: Mulliken charges with hydrogens summed into heavy atoms:
elementType: O O O N C C C C C C C C C C C C C C C C C C
charge: -0.243147 -0.288115 -0.273127 -0.087125 0.007780 0.065682 -0.115827 0.152629 0.426385 0.487195 -0.041034 -0.224768 -0.274407 -0.139231 -0.194221 0.225507 0.200556 -0.007253 -0.025469 -0.019086 0.166417 0.200660
polarizability: 2.82286114e+02 4.32995470e-01 2.11025757e+02 -3.74569810e+00 -1.22459954e+00 1.62864201e+02
1716.lowfreq: -7.4017 -2.6622 -0.0007 -0.0006 -0.0001 8.4072 19.9525 33.9414 40.6147
frequency: 19.8310 33.9194 40.5999 56.6620 94.9755 107.7848 116.9423 140.8301 153.6506 164.0195 189.6812 211.3297 224.1282 235.3960 243.7675 256.7120 269.9039 293.4092 319.6710 330.4434 344.5600 380.7139 390.8804 406.7184 422.2480 452.8230 460.3507 467.1856 501.8018 541.0641 565.2033 597.9851 615.3447 620.4248 645.5856 689.4849 710.5105 716.5895 721.4687 735.8955 753.6191 770.6026 825.0976 858.5606 878.2359 897.6167 904.0315 912.8079 928.0782 978.2249 980.8773 988.1663 989.3688 996.6569 998.0194 1025.4713 1071.8743 1078.8333 1090.3768 1104.0617 1106.9122 1113.8122 1135.9583 1154.0762 1164.9579 1168.6124 1172.4271 1178.4400 1193.3226 1210.1341 1217.2633 1246.1287 1248.9039 1295.6191 1315.9804 1326.5430 1375.7013 1376.5849 1390.6140 1411.7763 1432.0855 1435.1969 1445.1497 1449.5448 1453.7503 1460.5187 1464.9053 1465.8478 1467.3695 1469.4128 1476.1597 1477.3777 1502.1089 1559.0401 1572.2857 1588.2863 1606.3997 1620.7513 2851.6901 2966.6515 2988.6843 2994.4250 3023.7892 3056.7250 3085.4784 3104.2876 3112.0524 3119.6392 3124.3779 3126.1428 3132.4140 3135.4875 3146.8865 3148.0658 3159.3727 3161.6877 3491.5901
redmass: 5.0993 3.2425 3.4176 3.3351 2.6991 3.7061 4.0613 2.0023 4.0482 3.4910 4.4360 2.5873 1.1859 1.9898 2.6778 3.0686 1.5130 3.8784 4.9581 3.6805 4.3959 4.0085 4.6360 2.8805 3.3286 2.6711 3.5640 3.6563 3.9600 3.2828 3.6187 5.6816 6.3502 5.8169 4.7479 6.0156 1.7283 5.6623 4.6829 4.3392 3.8905 1.9840 3.5626 1.2473 1.5311 2.2930 2.4718 1.7437 1.4530 3.7708 1.5613 4.3591 5.5759 1.5020 1.6476 2.5591 1.9361 1.7986 2.5923 3.3594 1.2826 1.2589 1.7654 1.5527 1.7364 2.5521 1.1331 2.0314 1.1464 3.8793 2.1574 1.5014 1.4130 5.7409 1.4729 1.5553 2.5721 1.7593 6.7046 2.5485 1.9554 1.3451 1.3031 1.4712 1.0823 1.1151 1.1405 1.0705 1.0525 1.0783 1.0952 2.0272 2.8472 9.9985 8.8470 6.0766 5.9695 7.4954 1.0704 1.0323 1.0363 1.0311 1.0866 1.1042 1.0999 1.1012 1.0856 1.0989 1.0864 1.1004 1.1057 1.0920 1.0949 1.0915 1.0901 1.1013 1.0760
irintensity: 0.9774 2.5121 2.6247 5.3872 0.9126 4.7305 3.3209 4.6938 6.7424 0.8902 0.7078 2.1413 0.1087 6.4697 2.5850 5.3117 0.9678 5.3073 6.4193 5.6525 11.6872 6.9255 12.1417 1.3637 36.0118 40.1705 0.8770 12.6938 35.3918 65.1835 21.9897 20.0425 1.2920 29.0664 4.6555 6.8218 60.0279 22.9292 0.8429 8.5809 1.0362 35.8011 0.6455 0.5994 21.6382 39.9053 23.9411 3.1104 0.9404 34.7087 7.6882 26.5506 3.2887 3.4937 7.2558 14.0084 4.5529 11.7312 95.0788 12.9465 7.6953 0.0541 25.9512 25.7486 53.8272 11.8659 1.7719 29.3868 5.9722 31.7854 0.4989 12.7685 6.2884 657.2131 53.4307 15.3933 11.3401 17.7203 31.2866 12.5815 18.6825 2.3091 13.7289 1.8935 18.3209 6.1659 60.7402 18.7920 15.5930 14.3359 53.7203 19.7897 104.5522 152.6146 158.9145 1.2468 10.7900 28.1878 52.9536 50.9804 29.3712 87.0005 28.2923 38.3567 28.4254 37.4448 5.2820 11.8723 0.3762 25.5856 20.1058 23.3841 20.2276 5.5541 7.8250 32.2235 2.7414
temp: 298.150 k
press: 1.00000 atm
elementType: 8 8 8 7 6 6 6 6 6 6 6 6 6 6 6 6 6 6 6 6 6 6 1 1 1 1 1 1 1 1 1 1 1 1 1 1 1 1 1 1 1
symmnumber: 1
zpe: 862510.4 jmol-1
zpe.correction: 0.328513 hartree
zpe.thermalcorrener: 0.349115 hartree
zpe.thermalcorrenthalpy: 0.350059 hartree
zpe.thermalcorrgfe: 0.278699 hartree
zpe.sumelectzpe: -976.108141 hartree
zpe.sumelectthermal: -976.087539 hartree
zpe.sumelectthermalent: -976.086595 hartree
zpe.sumelectthermalfe: -976.157955 hartree
dipole: 1.6786 -1.1682 -0.5506
dipole: 2.1179
quadrupole: -107.8289 -120.4540 -130.7802
quadrupole: 13.5860 1.9277 -8.6190
quadrupole: 11.8588 -0.7663 -11.0925 13.5860 1.9277 -8.6190
hfenergy: -976.4366538 hartree
pointgroup: C01 [X(C18H19N1O3)]
dipole: 0.5998629 -0.5092925 0.2740463 debye
polarizability: 280.9031389|-12.2613655|179.7864876|-0.932446|-22.6536637|195.4864459 unknown
InChI: InChI=1S/C18H19NO3/c1-18(13-7-5-4-6-8-13)17(20)14-10-16(22-3)15(21-2)9-12(14)11-19-18/h4-10,19H,11H2,1-3H3
charge 0 multiplicity 1
41 atoms
O  -0.369297 2.242761 -1.035463
O  4.135935 -0.293595 -1.067004
O  3.878018 -2.116161 1.174565
N  -1.422433 0.743428 2.036668
C  -1.78629 1.180449 0.670484
C  -0.45198 1.382649 -0.105058
C  -0.651208 -0.500789 2.164321
C  0.687912 0.502304 0.248999
C  0.607942 -0.426491 1.320989
C  -2.688181 0.175487 -0.117232
C  -2.533913 2.531656 0.780491
C  1.869178 0.569315 -0.539332
C  1.710852 -1.26125 1.580732
C  -2.74287 0.186216 -1.535591
C  -3.536595 -0.718436 0.584564
C  2.963517 -0.272552 -0.288214
C  2.892788 -1.200088 0.808506
C  -3.617899 -0.678009 -2.230354
C  -4.413857 -1.582522 -0.108549
C  -4.457314 -1.567728 -1.520904
C  4.196198 0.630942 -2.203246
C  5.311427 -1.834152 0.949583
H  -2.177383 0.856507 2.720538
H  -1.222974 -1.411434 1.852545
H  -0.381286 -0.64035 3.22738
H  -3.512456 2.385075 1.274378
H  -1.931963 3.24715 1.367193
H  -2.704694 2.953493 -0.221815
H  1.871747 1.290004 -1.362651
H  1.696168 -1.977733 2.40889
H  -2.104016 0.877801 -2.095572
H  -3.522427 -0.734588 1.681585
H  -3.646024 -0.654988 -3.325878
H  -5.061868 -2.26545 0.453146
H  -5.135457 -2.238687 -2.060116
H  5.176186 0.449746 -2.668782
H  4.127488 1.683795 -1.86862
H  3.38949 0.420727 -2.93119
H  5.832284 -2.604398 1.539152
H  5.575907 -0.827234 1.319359
H  5.567847 -1.912668 -0.117396
