program: Gaussian 09
title: 000287026
version: EM64L-G09RevD.01
frameworkgroup: C1[X(C9H10F6O6)]
method: RPBEPBE
basis: SDD
operation: Freq
keyword: #p
keyword: freq=noraman
keyword: PBEPBE/SDD
title: #p freq=noraman PBEPBE/SDD
converged: YES YES NO NO
title: Mulliken charges:
elementType: F F F F F F O O O O O O C C C C C C C C C H H H H H H H H H H
charge: -0.156468 -0.156528 -0.153447 -0.182357 -0.182287 -0.153474 -0.225747 -0.225675 -0.408507 -0.408544 -0.230213 -0.230251 0.212021 0.322025 0.321930 -0.392554 -0.392631 -0.366190 -0.366247 0.214597 0.214733 0.272167 0.278279 0.272105 0.278352 0.276964 0.258373 0.276990 0.258361 0.387126 0.387098
chargesum: 0.00000
title: Mulliken charges with hydrogens summed into heavy atoms:
elementType: F F F F F F O O O O O O C C C C C C C C C
charge: -0.156468 -0.156528 -0.153447 -0.182357 -0.182287 -0.153474 -0.225747 -0.225675 -0.021381 -0.021447 -0.230213 -0.230251 0.212021 0.322025 0.321930 0.157892 0.157826 0.169147 0.169104 0.214597 0.214733
polarizability: 1.29957454e+02 6.84256042e+00 1.07640395e+02 -4.33287471e-03 1.41958783e-02 1.16319592e+02
1716.lowfreq: -8.6105 -3.6753 0.0008 0.0008 0.0010 2.2322 18.1871 18.6619 23.2532
frequency: 17.3328 18.6464 23.2496 37.1008 41.4255 46.3405 53.5499 55.8756 128.7533 129.9285 147.8478 176.7341 178.1298 207.6902 217.4803 252.8013 270.5258 275.8510 286.9721 296.3763 302.4320 303.3008 333.7251 372.8750 390.5477 421.2685 436.4491 449.1913 453.0925 486.9195 488.2771 508.1801 538.0069 584.5826 604.4625 605.3298 629.4314 630.1885 636.3945 677.6766 825.7469 829.8670 830.1807 869.8088 892.6273 893.1148 928.9960 990.6698 999.9897 1002.5594 1008.5298 1026.9259 1033.5465 1049.0186 1052.7870 1098.7518 1098.9911 1108.2767 1122.5934 1167.1048 1169.6425 1232.0711 1232.8215 1262.2638 1262.7966 1289.9147 1290.0960 1353.1398 1355.6433 1365.8832 1369.0852 1439.8653 1440.2139 1460.6437 1460.8458 1674.4411 1674.6983 3003.5984 3003.6551 3043.4458 3044.1307 3093.1936 3093.3841 3116.0479 3116.1383 3515.9690 3516.0406
redmass: 8.4139 8.6224 7.8533 8.7663 13.7107 11.9887 7.8138 9.9655 9.1685 7.1885 4.8405 3.7815 5.9872 4.8740 4.4977 9.9481 10.3817 10.4332 6.4580 12.2857 9.0638 11.3253 5.3334 6.6425 10.1192 3.2998 3.0039 5.5880 6.8663 1.9840 2.0685 8.8925 7.9240 14.4972 4.1123 4.1696 1.5764 1.5105 5.1826 6.0246 5.1193 4.6926 4.6977 3.0200 5.2004 5.1864 4.8163 3.0374 2.2833 7.0516 5.1848 3.0604 2.9646 3.1247 4.2654 4.0094 4.8184 11.2220 9.6045 3.4805 3.3070 1.1864 1.1977 1.6605 1.6648 1.2580 1.2525 1.3160 1.4151 1.4054 1.3288 1.0762 1.0764 1.0714 1.0719 8.7289 8.7266 1.0640 1.0641 1.0584 1.0584 1.0968 1.0968 1.1065 1.1066 1.0643 1.0643
irintensity: 0.1488 0.0882 0.1910 1.6388 0.4659 0.5825 0.0008 2.3312 2.1337 14.7429 0.8484 4.3881 0.0764 7.1244 1.6739 5.4264 0.2580 1.9688 0.0010 2.0015 5.9269 0.2651 0.9740 10.3087 11.3311 0.3771 16.4073 11.4170 21.0044 12.6501 50.2932 1.3084 4.9368 9.2368 111.6956 0.1519 152.4211 27.0766 175.6255 24.6128 63.7482 11.1253 2.5029 23.8325 56.9379 11.2029 111.9565 180.7030 11.2841 81.0594 155.4824 165.2362 375.2721 52.3128 107.0901 2.0205 18.0040 15.5575 21.8685 8.8461 12.4392 3.9633 15.8655 13.5161 14.9038 6.8973 1.8710 21.2140 9.2677 25.4521 0.8007 25.0922 44.0647 15.0512 10.6453 80.5439 315.2222 2.5768 28.6229 18.7484 6.6205 4.8138 3.2104 0.3298 0.4027 40.8359 23.8655
temp: 298.150 k
press: 1.00000 atm
elementType: 9 9 9 9 9 9 8 8 8 8 8 8 6 6 6 6 6 6 6 6 6 1 1 1 1 1 1 1 1 1 1
symmnumber: 1
zpe: 522915.8 jmol-1
zpe.correction: 0.199168 hartree
zpe.thermalcorrener: 0.221304 hartree
zpe.thermalcorrenthalpy: 0.222248 hartree
zpe.thermalcorrgfe: 0.143822 hartree
zpe.sumelectzpe: -1397.666552 hartree
zpe.sumelectthermal: -1397.644417 hartree
zpe.sumelectthermalent: -1397.643473 hartree
zpe.sumelectthermalfe: -1397.721898 hartree
dipole: 0.0041 -0.0017 -2.4727
dipole: 2.4727
quadrupole: -105.2296 -125.4665 -117.6803
quadrupole: 5.9858 -0.0199 0.0153
quadrupole: 10.8959 -9.3410 -1.5548 5.9858 -0.0199 0.0153
hfenergy: -1397.8657202 hartree
pointgroup: C01 [X(C9H10F6O6)]
dipole: 0.0035886 -0.9728267 0.0054811 debye
polarizability: 128.3500374|0.0158607|116.319313|-8.950167|-0.0781187|109.2480902 unknown
InChI: InChI=1S/C9H10F6O6/c10-7(11,3-20-1-5(16)17)9(14,15)8(12,13)4-21-2-6(18)19/h16,18H,1-4H2
charge 0 multiplicity 1
31 atoms
F  -0.90309 -0.666932 0.707009
F  0.899615 -0.662403 -0.688044
F  -1.096258 0.163609 -2.138418
F  -0.016088 2.075491 -1.493424
F  -0.020512 2.091119 1.484171
F  1.08026 0.198113 2.150076
O  -3.387935 1.005309 -1.078047
O  3.363157 1.051426 1.080553
O  -4.774689 -1.492365 1.255463
O  4.774776 -1.454295 -1.229038
O  -4.117321 0.69584 1.703161
O  4.093226 0.721961 -1.698305
C  -0.007101 0.194152 0.005342
C  -0.865168 1.009229 -1.023261
C  0.840764 1.029575 1.026036
C  -2.204255 1.621339 -0.502723
C  2.173424 1.650888 0.500234
C  -3.777773 -0.297212 -0.555602
C  3.764538 -0.252416 0.57019
C  -4.222398 -0.258012 0.906113
C  4.207656 -0.223189 -0.89222
H  -2.227122 2.662018 -0.861866
H  -2.2315 1.619802 0.599557
H  2.185843 2.694772 0.850496
H  2.200469 1.640191 -0.602011
H  -4.629248 -0.613863 -1.179272
H  -2.978868 -1.056753 -0.6624
H  4.61917 -0.555484 1.19626
H  2.972523 -1.01803 0.684682
H  -5.0451 -1.485402 2.213645
H  5.045506 -1.453674 -2.18716
