program: Gaussian 09
title: 000287024
version: EM64L-G09RevD.01
frameworkgroup: C1[X(C11H9F7O2)]
method: RPBEPBE
basis: SDD
operation: Freq
keyword: #p
keyword: freq=noraman
keyword: PBEPBE/SDD
title: #p freq=noraman PBEPBE/SDD
converged: YES YES NO NO
title: Mulliken charges:
elementType: F F F F F F F O O C C C C C C C C C C C H H H H H H H H H
charge: -0.156695 -0.150731 -0.141987 -0.126988 -0.122924 -0.121160 -0.146269 -0.432783 -0.218776 -0.277820 -0.240843 -0.258090 -0.243436 -0.542331 0.249099 -0.211897 -0.207093 0.157448 0.199582 0.359139 0.345963 0.285713 0.273024 0.314030 0.267760 0.252375 0.256100 0.250563 0.389029
chargesum: 0.00000
title: Mulliken charges with hydrogens summed into heavy atoms:
elementType: F F F F F F F O O C C C C C C C C C C C
charge: -0.156695 -0.150731 -0.141987 -0.126988 -0.122924 -0.121160 -0.146269 -0.043754 -0.218776 0.068143 0.044870 0.014934 0.070594 -0.022196 0.249099 0.044203 0.043470 0.157448 0.199582 0.359139
polarizability: 1.28332652e+02 -4.86978933e+00 1.24531474e+02 -4.28177778e+00 1.04559978e+00 1.02935747e+02
1716.lowfreq: -13.1067 -0.0004 0.0003 0.0005 2.4001 11.0048 24.9364 34.0371 41.8403
frequency: 24.8574 33.8261 41.8015 64.1335 81.2527 100.8740 122.6446 153.2118 161.4820 201.9721 226.5511 249.5529 257.9381 273.1960 290.0796 300.5584 319.8449 332.4460 358.0842 402.0799 413.1455 457.8404 477.2156 495.4142 516.6539 554.0513 568.8022 586.7652 600.9741 648.7070 654.0098 694.3019 728.7047 764.2024 775.8958 796.6206 848.0400 876.7504 887.4856 894.4938 917.0962 931.1960 944.4453 954.3907 967.1378 992.0487 998.3095 1007.9630 1025.1451 1044.3482 1062.5083 1073.0943 1079.9374 1095.3080 1109.9009 1137.8321 1154.7326 1191.9912 1202.4601 1205.9013 1212.8360 1234.6708 1265.2017 1269.0573 1278.6144 1300.2555 1307.4735 1329.1040 1375.1747 1479.1746 1583.8567 1660.2125 3030.2231 3055.6041 3075.8384 3099.3402 3107.9424 3114.1594 3171.4346 3203.8787 3519.2956
redmass: 12.9978 9.7967 12.0257 9.8866 8.2031 9.2458 4.9930 8.8563 6.5541 17.9192 10.6709 8.7804 12.6036 9.5054 14.4664 9.9646 11.4139 5.2445 11.8507 5.7364 10.9523 14.1703 2.4164 4.0441 8.5416 2.9713 12.5528 6.6958 1.7742 13.2128 2.8912 3.5151 2.2030 3.7197 5.4813 4.7941 3.6676 4.3332 3.0668 4.8004 2.4698 1.6738 2.4978 3.4833 3.3028 4.0682 1.8561 4.3368 2.9275 10.5277 3.2821 8.9672 2.0804 1.2393 1.2813 2.2937 2.3198 1.4504 4.1587 6.2128 1.5474 1.3378 1.4419 1.4986 1.4038 2.1993 1.4964 1.6338 1.4238 1.1016 5.7270 8.7908 1.0603 1.0832 1.0854 1.0901 1.1056 1.0921 1.0884 1.1094 1.0641
irintensity: 0.0049 0.2106 1.9368 0.1692 0.1988 0.4697 0.4949 0.7825 1.1553 3.3854 3.5306 0.3986 1.0249 2.2048 0.7349 0.9255 0.2860 2.3102 0.9779 1.2980 9.9735 12.9304 6.0629 1.5524 4.0860 33.9525 13.6746 6.2579 78.6144 43.6292 39.3677 44.3707 37.9806 25.5188 0.2491 21.4423 1.5137 100.1215 13.9459 81.9975 33.7977 6.8245 27.1597 12.7791 17.3441 19.7735 17.7202 29.8297 27.4265 306.7706 87.9469 227.8414 141.6701 4.2889 36.8491 43.9605 6.3759 32.5422 38.3266 35.1070 13.1213 1.0049 4.6922 3.8705 3.0275 15.8319 16.2123 24.6749 9.3755 11.9083 0.8314 279.7720 23.3129 4.3143 0.7642 22.8455 18.3207 11.6232 3.0278 8.7870 32.9980
temp: 298.150 k
press: 1.00000 atm
elementType: 9 9 9 9 9 9 9 8 8 6 6 6 6 6 6 6 6 6 6 6 1 1 1 1 1 1 1 1 1
symmnumber: 1
zpe: 496483.5 jmol-1
zpe.correction: 0.189101 hartree
zpe.thermalcorrener: 0.207242 hartree
zpe.thermalcorrenthalpy: 0.208187 hartree
zpe.thermalcorrgfe: 0.141629 hartree
zpe.sumelectzpe: -1272.367774 hartree
zpe.sumelectthermal: -1272.349632 hartree
zpe.sumelectthermalent: -1272.348688 hartree
zpe.sumelectthermalfe: -1272.415245 hartree
dipole: -1.7675 -0.7084 -3.1187
dipole: 3.6541
quadrupole: -118.8653 -109.4070 -116.6032
quadrupole: 3.5094 4.9350 -5.6782
quadrupole: -3.9068 5.5515 -1.6447 3.5094 4.9350 -5.6782
hfenergy: -1272.5568741 hartree
pointgroup: C01 [X(C11H9F7O2)]
dipole: 0.7367995 -0.2343543 1.2120116 debye
polarizability: 127.682255|4.9268423|124.9236864|-4.9004238|-1.6062523|103.1939329 unknown
InChI: InChI=1S/C11H9F7O2/c12-9(13,10(14,15)11(16,17)18)7-5-2-1-4(3-5)6(7)8(19)20/h1-2,4-7,19H,3H2
charge 0 multiplicity 1
29 atoms
F  -0.703217 1.173587 -1.637908
F  -0.302004 -1.05358 -1.940524
F  -2.059092 -1.744898 0.084437
F  -2.921769 -0.419789 -1.565239
F  -2.69985 1.845589 0.233421
F  -4.010529 0.115935 0.884693
F  -1.980569 0.420324 1.847809
O  1.891537 2.397083 0.760823
O  3.265528 2.290537 -1.105554
C  0.504825 0.026145 0.109361
C  0.785552 -1.248937 1.018749
C  2.855009 -0.727604 0.220378
C  1.905353 0.326464 -0.53696
C  2.158351 -0.797696 1.611742
C  -0.596995 -0.081696 -0.93431
C  1.234764 -2.403731 0.114914
C  2.476485 -2.092898 -0.356808
C  2.418742 1.743179 -0.36799
C  -2.051271 -0.426464 -0.452448
C  -2.693298 0.506678 0.6328
H  0.234515 0.863505 0.77539
H  -0.019676 -1.46783 1.732442
H  3.918893 -0.453133 0.18285
H  1.9274 0.117269 -1.618328
H  2.599168 -1.570461 2.261405
H  2.116911 0.170166 2.140528
H  0.610262 -3.256317 -0.158874
H  3.064158 -2.637796 -1.099234
H  2.289317 3.307169 0.825635
