program: Gaussian 09
title: 000287019
version: EM64L-G09RevD.01
frameworkgroup: C1[X(C9H3Cl6N)]
method: RPBEPBE
basis: SDD
operation: Freq
keyword: #p
keyword: freq=noraman
keyword: PBEPBE/SDD
title: #p freq=noraman PBEPBE/SDD
converged: YES YES NO NO
title: Mulliken charges:
elementType: Cl Cl Cl Cl Cl Cl N C C C C C C C C C H H H
charge: 0.104996 0.130789 0.130660 0.107973 0.114479 0.107992 0.018278 0.515865 0.643529 0.339606 -0.511635 -0.348168 -0.283154 -0.839675 -0.820523 -0.248663 0.288921 0.267375 0.281354
chargesum: 0.00000
title: Mulliken charges with hydrogens summed into heavy atoms:
elementType: Cl Cl Cl Cl Cl Cl N C C C C C C C C C
charge: 0.104996 0.130789 0.130660 0.107973 0.114479 0.107992 0.018278 0.515865 0.643529 0.339606 -0.222715 -0.080793 -0.001800 -0.839675 -0.820523 -0.248663
polarizability: 2.03409173e+02 -1.38908189e+01 1.77796220e+02 7.74188844e-03 -5.56975457e-03 1.14637784e+02
1716.lowfreq: -2.7608 -0.0020 0.0011 0.0027 6.6148 9.4312 13.0488 38.2141 48.1220
frequency: 12.7568 38.2047 48.1079 102.1369 118.3896 127.3672 134.2762 147.0102 183.6650 201.7196 206.1983 242.8142 249.2044 278.3074 287.6463 308.6820 359.7962 360.2430 367.5253 386.1522 396.5958 482.5834 503.1308 572.7373 596.5574 623.8195 667.2709 705.6033 711.5366 739.3575 772.5128 778.0772 831.3523 853.8146 932.1473 954.9646 975.6429 1105.1627 1186.1758 1208.8956 1233.0778 1286.3901 1366.9635 1384.8842 1476.0870 1559.3290 1603.7137 2184.6813 3163.0674 3182.5329 3191.1951
redmass: 22.7516 19.5320 10.3754 18.4325 9.9486 15.8241 8.2621 29.5862 30.3005 15.4200 21.0659 22.5814 16.8586 18.2029 17.7487 19.3510 17.5013 11.9814 5.7739 5.5220 16.0680 9.4186 4.6895 8.8680 6.9961 9.2678 7.7731 10.0136 4.8632 9.5907 9.8962 3.8344 8.0753 1.6026 1.5451 5.4061 1.3847 3.7606 1.7122 2.1018 4.0972 1.3620 9.8311 3.4540 2.6931 7.3192 6.4450 12.6361 1.0905 1.0924 1.0946
irintensity: 0.4204 0.1034 1.0353 2.5485 0.0485 1.2752 0.6026 0.1957 0.0979 1.1587 2.0362 0.1198 0.0911 1.8767 11.0798 6.1505 0.2685 1.2314 0.0051 0.0471 13.4983 11.9225 4.3897 4.9827 49.6837 4.7712 94.6307 173.8741 246.5809 65.9914 28.0832 9.8180 145.2153 0.0370 7.1716 14.8754 0.5881 0.5629 36.9255 99.3864 3.1147 5.5887 2.1645 26.9398 9.4444 1.7701 1.2287 2.3956 0.1666 2.4210 0.9418
temp: 298.150 k
press: 1.00000 atm
elementType: 17 17 17 17 17 17 7 6 6 6 6 6 6 6 6 6 1 1 1
symmnumber: 1
zpe: 247567.6 jmol-1
zpe.correction: 0.094294 hartree
zpe.thermalcorrener: 0.110765 hartree
zpe.thermalcorrenthalpy: 0.111709 hartree
zpe.thermalcorrgfe: 0.047099 hartree
zpe.sumelectzpe: -3158.687914 hartree
zpe.sumelectthermal: -3158.671443 hartree
zpe.sumelectthermalent: -3158.670499 hartree
zpe.sumelectthermalfe: -3158.735108 hartree
dipole: 1.7362 -3.3223 0.0006
dipole: 3.7486
quadrupole: -146.3052 -137.3019 -133.5253
quadrupole: 7.3931 -0.0024 0.0000
quadrupole: -7.2611 1.7422 5.5188 7.3931 -0.0024 0.0000
hfenergy: -3158.7822075 hartree
pointgroup: C01 [X(C9H3Cl6N1)]
dipole: -0.7815968 1.2506771 -0.0032557 debye
dipolederiv: -0.2145326 -0.1494007 0.0008898 -0.1258586 -0.6822514 0.0025295 0.0008597 0.0026854 -0.1441796 -0.3948341 0.0242964 -0.2123577 0.094985 -0.1978294 0.1980565 -0.2375103 0.17336 -0.5588076 -0.3918803 0.0246743 0.2111143 0.0954914 -0.2007715 -0.2017383 0.2359266 -0.1764258 -0.5595499 -0.4410328 0.089732 -0.203506 0.1461517 -0.2451497 0.2453531 -0.2561186 0.2110746 -0.5767949 -0.2493303 -0.1420774 0.0009547 -0.154117 -0.6424519 0.0024839 0.0011303 0.0025402 -0.1362529 -0.4379139 0.0896744 0.2017304 0.1462893 -0.2487827 -0.2490977 0.2542588 -0.214466 -0.5768105 -0.2111573 -0.0335041 0.0001796 0.0120484 -0.219231 -0.0000191 -0.0001411 0.0001639 -0.2040337 -0.186867 -0.0316696 0.0002285 -0.1561834 -0.1101784 0.0003555 0.0003381 -0.0001214 -0.1604752 -0.1938138 0.0080663 0.0000778 -0.1606106 -0.1761314 0.000729 0.0003654 0.0000395 -0.1552476 0.0279762 -0.0929202 0.0008047 0.0605653 0.1795788 -0.0004343 0.0002219 -0.000058 0.1312428 -0.1281646 0.1002892 -0.0003936 -0.0256662 -0.0476303 -0.0002626 0.0001711 -0.0005121 -0.0959189 -0.2347892 0.1972907 -0.0004514 -0.0124911 0.0030423 -0.0004994 0.0005935 -0.0012034 -0.0930071 0.0311732 -0.1826779 0.0005095 0.0486682 -0.0018913 -0.0003999 -0.000522 0.0002719 -0.0626874 1.229953 0.169921 -0.0004984 0.0450492 1.2147914 0.000501 0.0000257 -0.0000557 1.3554864 1.4068123 -0.0095949 0.0000325 0.0085086 1.207737 0.0008379 -0.0001642 0.0008827 1.3822933 0.0846511 -0.0386094 0.0001366 -0.0547493 0.0359488 0.0002936 0.0003117 0.0002439 0.0364727 0.1361271 -0.0360155 0.0002204 -0.0176371 0.0444323 0.0005952 0.0001326 0.000661 0.1470649 0.1186506 -0.0416115 0.0003028 -0.0205753 0.0302244 0.0006467 0.000225 0.0007058 0.1432542 0.0489724 0.0541368 0.0000256 0.0701315 0.0565441 0.0000695 -0.0001042 0.0002135 0.1279512 unknown
polarizability: 205.3870218|-11.7635582|175.8159661|-0.283858|-0.2641876|114.6401894 unknown
InChI: InChI=1S/C9H3Cl6N/c10-8(11,12)6-1-2-7(9(13,14)15)5(3-6)4-16/h1-3H
charge 0 multiplicity 1
19 atoms
Cl 3.177619 2.548669 -0.022189
Cl 3.460353 -0.023428 1.506176
Cl 3.448828 -0.035241 -1.532604
Cl -3.903566 0.813509 -1.501996
Cl -3.738695 -1.786144 0.021383
Cl -3.891734 0.825286 1.525632
N  1.988904 -3.03851 0.008637
C  1.178158 0.534151 -0.006765
C  -1.659104 0.135945 0.005781
C  0.623482 -0.786193 0.001928
C  -0.784674 -0.968507 0.008108
C  0.28375 1.630041 -0.008764
C  -1.109151 1.442157 -0.002694
C  2.684178 0.744197 -0.013255
C  -3.1675 -0.016414 0.012233
C  1.420579 -1.987231 0.005476
H  -1.179989 -1.98666 0.014797
H  0.682782 2.646019 -0.015221
H  -1.77052 2.313555 -0.004564
