program: Gaussian 09
title: 000287018
version: EM64L-G09RevD.01
frameworkgroup: C1[X(C8H3Cl7)]
method: RPBEPBE
basis: SDD
operation: Freq
keyword: #pfreq=noraman
keyword: PBEPBE/SDD
title: #p freq=noraman PBEPBE/SDD
converged: YES YES NO NO
title: Mulliken charges:
elementType: Cl Cl Cl Cl Cl Cl Cl C C C C C C C C H H H
charge: 0.017139 0.097463 0.116760 0.116776 0.103932 0.107416 0.103962 0.701308 0.638482 -0.242666 -0.338963 -0.336115 -0.293882 -0.809080 -0.810940 0.263598 0.286929 0.277881
chargesum: 0.00000
title: Mulliken charges with hydrogens summed into heavy atoms:
elementType: Cl Cl Cl Cl Cl Cl Cl C C C C C C C C
charge: 0.017139 0.097463 0.116760 0.116776 0.103932 0.107416 0.103962 0.701308 0.638482 -0.242666 -0.075365 -0.049186 -0.016001 -0.809080 -0.810940
polarizability: 1.99998003e+02 9.21780772e+00 1.62519872e+02 -6.78225814e-03 -2.16088276e-03 1.12363629e+02
1716.lowfreq: -3.8784 -0.0032 -0.0021 0.0021 4.5994 5.9950 12.0323 38.0729 54.3756
frequency: 11.5432 38.0688 54.3680 104.1279 118.9535 145.0420 159.4162 164.4947 191.0295 202.6440 207.5985 246.2212 259.6054 279.3769 282.7538 316.9483 359.3040 385.8626 387.0322 435.9831 441.8231 444.1332 565.5427 616.8815 655.9873 673.8068 703.7826 715.0234 758.9128 759.5871 824.1127 841.0003 900.1916 919.2585 965.7438 1038.3427 1173.2972 1201.7315 1204.0261 1276.5919 1351.5084 1384.3737 1466.7731 1549.1852 1604.7387 3165.5131 3186.2244 3191.7607
redmass: 25.3476 20.7058 11.2817 20.3248 10.4585 30.4083 8.3427 30.4278 31.9003 25.6778 13.9766 21.4728 21.4849 25.9970 16.1836 17.8524 30.6825 6.4225 14.3555 7.9860 9.6055 3.8408 6.1504 9.5451 8.1521 8.6006 4.2799 11.7097 4.0910 10.4088 8.3461 1.5885 1.5158 8.1026 1.3788 3.5099 1.5027 3.6513 2.6940 1.3607 4.4468 4.5368 2.5776 7.8144 6.9302 1.0900 1.0919 1.0947
irintensity: 0.0882 0.4034 0.3017 1.3971 0.0124 0.0021 0.2580 0.0658 0.4912 2.0574 0.2702 0.0208 0.4970 5.2871 1.2905 5.0113 0.1980 0.0196 8.3471 12.5771 30.1802 0.1833 59.4337 5.7366 23.1529 60.7246 337.7847 175.4666 2.9376 11.2559 184.3270 0.0142 4.1515 8.3438 0.1510 28.3660 23.7344 82.5468 61.1439 23.8106 38.6087 38.2612 9.2284 16.0591 7.7906 0.1162 4.4531 0.9319
temp: 298.150 k
press: 1.00000 atm
elementType: 17 17 17 17 17 17 17 6 6 6 6 6 6 6 6 1 1 1
symmnumber: 1
zpe: 226873.1 jmol-1
zpe.correction: 0.086411 hartree
zpe.thermalcorrener: 0.102314 hartree
zpe.thermalcorrenthalpy: 0.103258 hartree
zpe.thermalcorrgfe: 0.039718 hartree
zpe.sumelectzpe: -3525.950504 hartree
zpe.sumelectthermal: -3525.934601 hartree
zpe.sumelectthermalent: -3525.933657 hartree
zpe.sumelectthermalfe: -3525.997197 hartree
dipole: -0.7831 -1.0003 0.0002
dipole: 1.2704
quadrupole: -147.8144 -128.3953 -136.1579
quadrupole: -1.0708 0.0012 -0.0009
quadrupole: -10.3586 9.0606 1.2980 -1.0708 0.0012 -0.0009
hfenergy: -3526.0369155 hartree
pointgroup: C01 [X(C8H3Cl7)]
dipole: 0.3082597 -0.393418 -0.0015945 debye
dipolederiv: -0.2218723 0.2232196 0.0007267 0.2708258 -0.5475112 -0.0025218 0.000976 -0.0026217 -0.010534 -0.2416094 -0.1741682 -0.0015086 -0.140399 -0.6689667 -0.0041502 -0.0012356 -0.0042556 -0.1545538 -0.4202776 0.0560931 0.2148461 0.1315181 -0.1953392 -0.2151969 0.2554097 -0.1902982 -0.5846987 -0.4169432 0.0578154 -0.2127679 0.1336391 -0.2011511 0.2214876 -0.2521978 0.1960898 -0.5818959 -0.4335285 0.0967788 0.1899653 0.1670953 -0.2655813 -0.2600895 0.2514194 -0.2284717 -0.5862191 -0.2810252 -0.1830327 -0.0018753 -0.1920076 -0.6338559 -0.0044289 -0.0018383 -0.0043249 -0.1417057 -0.4302269 0.098089 -0.1874967 0.1690431 -0.272985 0.2659098 -0.2475401 0.2337495 -0.5815337 -0.3662644 0.0485406 -0.0004157 -0.0348664 -0.3260015 -0.0012788 -0.0011201 -0.0009663 -0.1402375 -0.2626517 0.0257074 -0.0001883 -0.1182842 -0.0227045 0.0004872 -0.0016508 0.0009349 -0.1582363 0.3384469 -0.5760334 -0.0024416 -0.3173392 0.8476916 0.0045786 -0.0006193 0.0035335 -0.0356117 -0.0334603 0.1034303 0.0008904 -0.0941354 -0.01977 0.000185 -0.0003639 0.0008685 -0.095479 -0.2494898 0.2901539 0.0012383 -0.0180666 -0.197857 -0.0009721 -0.0007638 0.0002256 -0.0651304 -0.111317 -0.2017142 -0.0014683 0.0058202 -0.0201791 0.0005093 -0.0001 -0.0003092 -0.0811219 1.3772333 0.1599723 0.0007954 0.0168739 1.1763613 -0.0014885 -0.000256 -0.0009832 1.4020694 1.4504852 -0.0093808 0.0002056 -0.0051227 1.2204486 -0.0011351 0.000121 -0.0011575 1.39142 0.1186867 -0.0345302 -0.000312 -0.0236421 0.0286338 -0.0008349 -0.000212 -0.0008978 0.1426952 0.1306036 -0.0382599 -0.0003089 -0.0210263 0.0588985 -0.0006457 -0.000212 -0.0006985 0.1471585 0.0532106 0.0573187 0.0001155 0.070074 0.0398688 -0.000415 0.0001837 -0.000417 0.1336145 unknown
polarizability: 200.0055228|-9.2022128|162.5097071|0.2264516|0.2945252|112.3662734 unknown
InChI: InChI=1S/C8H3Cl7/c9-6-3-4(7(10,11)12)1-2-5(6)8(13,14)15/h1-3H
charge 0 multiplicity 1
18 atoms
Cl -1.516285 2.611852 0.012231
Cl -3.444235 -2.126501 -0.025792
Cl -3.590108 0.439256 1.514784
Cl -3.579725 0.461003 -1.5307
Cl 3.727376 -0.911069 -1.50766
Cl 3.764842 1.687743 0.02594
Cl 3.717518 -0.933973 1.519719
C  -1.328515 -0.232134 -0.005235
C  1.540289 -0.069231 0.005342
C  -0.649707 1.01907 0.005163
C  -0.512668 -1.396637 -0.010405
C  0.756363 1.103038 0.010366
C  0.888411 -1.327829 -0.005245
C  -2.843516 -0.348468 -0.011132
C  3.054695 -0.033504 0.010601
H  -0.996358 -2.375054 -0.018628
H  1.229032 2.087154 0.018381
H  1.474494 -2.251015 -0.009532
