program: Gaussian 09
title: 000287021
version: EM64L-G09RevD.01
frameworkgroup: C1[X(C10Cl8N2)]
method: RPBEPBE
basis: SDD
operation: Freq
keyword: #pfreq=noraman
keyword: PBEPBE/SDD
title: #p freq=noraman PBEPBE/SDD
converged: YES YES NO NO
title: Mulliken charges:
elementType: Cl Cl Cl Cl Cl Cl Cl Cl N N C C C C C C C C C C
charge: 0.068017 0.067396 0.068012 0.067412 0.070880 0.073044 0.070868 0.073047 0.017310 0.017316 0.436980 0.437034 -0.318300 -0.283583 -0.318334 -0.283581 -0.062972 -0.068764 -0.062996 -0.068787
chargesum: 0.00000
title: Mulliken charges with hydrogens summed into heavy atoms:
polarizability: 4.44697614e+02 4.89538173e+00 1.71587635e+02 6.46416115e-03 5.41728621e-04 1.39669663e+02
1716.lowfreq: -2.6775 -1.9364 0.0023 0.0028 0.0033 2.1900 20.0582 20.9964 26.7940
frequency: 20.0580 20.9944 26.7887 60.8860 65.9888 81.6093 83.2891 115.2374 139.0483 140.9045 151.9229 152.3845 160.8412 163.3793 173.8331 196.3071 222.9864 256.8843 290.1526 295.4411 336.4658 336.9435 351.1820 351.4829 380.2380 391.6243 449.0794 486.3032 490.1334 625.1003 628.0442 641.7726 642.4208 673.5256 685.0728 689.0457 706.8316 741.8301 800.7437 929.4634 931.9639 1005.5522 1085.9361 1212.1858 1223.5137 1230.3024 1234.2683 1290.2222 1524.6238 1536.3507 1561.2722 1564.0629 1595.1486 1664.1509
redmass: 32.1148 27.3809 28.8042 29.5316 28.7349 34.3355 34.5286 30.1298 15.4849 14.9598 33.7705 34.5249 29.2476 28.6452 26.8204 21.5869 13.6302 13.8431 13.9572 13.8499 27.4667 29.9550 32.0636 32.0787 13.4286 13.0208 15.4279 15.0354 14.5798 13.6140 13.9603 12.1376 12.1822 14.1401 12.1201 12.1445 13.4103 13.5666 13.2439 12.5893 12.5723 12.4748 12.3944 12.1951 12.0934 12.1272 12.0712 12.4207 12.0817 12.0468 12.0559 12.0323 12.4982 13.1936
irintensity: 0.0007 0.0037 0.0796 0.0799 0.0370 0.0064 0.0003 0.0019 0.2077 0.4533 0.5678 0.0133 0.3279 0.0146 0.1408 0.0020 0.3463 1.2909 10.2025 0.2420 0.9715 0.2206 0.2928 0.0925 11.1966 0.1826 3.0911 135.4774 1.3049 9.0636 26.4751 2.3258 2.3230 10.8093 5.6569 31.7858 213.1251 65.6619 8.8366 0.4482 10.3961 0.0540 50.8912 17.4222 656.5822 41.6580 11.7444 16.0111 0.0131 1.8528 79.6351 37.6196 71.1659 20.9574
temp: 298.150 k
press: 1.00000 atm
elementType: 17 17 17 17 17 17 17 17 7 7 6 6 6 6 6 6 6 6 6 6
symmnumber: 1
zpe: 196282.0 jmol-1
zpe.correction: 0.074760 hartree
zpe.thermalcorrener: 0.095323 hartree
zpe.thermalcorrenthalpy: 0.096267 hartree
zpe.thermalcorrgfe: 0.020656 hartree
zpe.sumelectzpe: -4169.497498 hartree
zpe.sumelectthermal: -4169.476936 hartree
zpe.sumelectthermalent: -4169.475991 hartree
zpe.sumelectthermalfe: -4169.551602 hartree
dipole: 0.0002 0.0000 -0.5228
dipole: 0.5228
quadrupole: -167.1999 -168.0316 -168.3629
quadrupole: -1.2538 0.0004 0.0003
quadrupole: 0.6649 -0.1668 -0.4981 -1.2538 0.0004 0.0003
hfenergy: -4169.5722582 hartree
pointgroup: C01 [X(C10Cl8N2)]
dipole: 0.0007336 0.0015975 -0.205697 debye
dipolederiv: -0.0526629 -0.0216081 -0.0039877 -0.1420784 -0.3863999 -0.355309 -0.084612 -0.3330055 -0.2486249 -0.1663723 -0.2412954 -0.1276219 -0.0996591 -0.3192068 -0.2034388 -0.0099535 -0.2159494 -0.0810842 -0.0532208 -0.0237967 0.0048446 -0.1456752 -0.3967695 0.3521648 0.0836638 0.3306078 -0.2377139 -0.167224 -0.2445696 0.1232406 -0.1010813 -0.325683 0.1990243 0.0077215 0.210569 -0.0737895 -0.8812325 -0.1383772 0.0584201 -0.3548277 -0.0499833 -0.0024262 -0.0016705 -0.0277479 0.0195688 -0.4919319 0.1589087 0.2008699 0.4439224 -0.1720709 -0.2371871 0.5269488 -0.2146168 -0.2095332 -0.8806716 -0.1377183 -0.0664641 -0.354937 -0.050477 -0.0009977 -0.0097845 0.0257633 0.0195284 -0.4871785 0.1605333 -0.2002443 0.4503463 -0.178968 0.2405971 -0.5219818 0.2161337 -0.2073233 0.199881 0.0116445 -0.4394742 -0.6134731 -0.0637124 -0.5237094 -1.0521615 -0.0545029 -0.0961344 0.1909489 0.004717 0.441351 -0.6323417 -0.072416 0.5199855 1.0445517 0.0547927 -0.0780329 -0.0717033 -0.0871487 0.097115 0.503214 0.0789035 0.0055284 0.5431072 -0.0245567 0.1411878 -0.0679498 -0.0858562 -0.0998079 0.5115166 0.078502 -0.003154 -0.5367309 0.0230494 0.137417 0.3521199 0.0118737 -0.0233926 0.1771459 0.3975093 0.4818691 0.0086608 0.4113012 0.2729457 0.0749991 0.2728562 0.0822221 0.0030609 0.2129561 0.1349149 -0.1632842 0.1517349 -0.0545379 0.3521903 0.0141578 0.0240869 0.1803302 0.4109469 -0.4787679 -0.0054589 -0.4090933 0.259634 0.074409 0.2750873 -0.0770139 0.0014875 0.2174997 -0.1306478 0.164418 -0.1456452 -0.0584905 1.0576637 0.3648041 0.0320765 1.1052187 -0.0215931 -0.1653645 0.5468669 -0.098025 -0.1779516 -0.0180154 -0.328498 -0.2905144 -1.0175765 0.326999 0.4436958 -0.8174013 0.3789147 0.4279057 1.0610275 0.3647379 -0.0182922 1.1125618 -0.025479 0.1749583 -0.5216984 0.1027327 -0.1773784 -0.0250765 -0.3304523 0.2825867 -1.0271544 0.3394424 -0.4517359 0.7987987 -0.3824568 0.4224072 unknown
polarizability: 443.7716749|16.5785634|172.5075815|1.1154931|0.3071917|139.6756554 unknown
InChI: InChI=1S/C10Cl8N2/c11-1-2(12)6(16)9(5(1)15)19-20-10-7(17)3(13)4(14)8(10)18
charge 0 multiplicity 1
20 atoms
Cl 2.908348 2.315047 1.905461
Cl 1.096134 -2.175903 -1.165388
Cl -2.920368 -2.343441 1.851637
Cl -1.088893 2.193764 -1.138598
Cl 5.639036 1.032841 0.042493
Cl 4.542487 -1.676717 -1.798151
Cl -5.638949 -1.033652 -0.010088
Cl -4.530781 1.703919 -1.801765
N  0.536293 0.35825 0.995512
N  -0.542657 -0.373055 0.986699
C  1.723082 0.115646 0.479842
C  -1.726183 -0.122653 0.467237
C  2.914685 0.936344 0.788338
C  2.15687 -0.915967 -0.491353
C  -2.919631 -0.94803 0.755432
C  -2.153776 0.923487 -0.491047
C  3.971285 0.43657 0.064971
C  3.497912 -0.723747 -0.731255
C  -3.971535 -0.437505 0.032706
C  -3.493161 0.7348 -0.742681
