program: Gaussian 09
title: 000287007
version: EM64L-G09RevD.01
frameworkgroup: C1[X(C7H11N3OS)]
method: RPBEPBE
basis: SDD
operation: Freq
keyword: #p
keyword: freq=noraman
keyword: PBEPBE/SDD
title: #p freq=noraman PBEPBE/SDD
converged: NO YES NO NO
title: Mulliken charges:
elementType: S O N N N C C C C C C C H H H H H H H H H H H
charge: 0.203116 -0.161483 -0.360180 -0.013662 -0.001646 -0.331823 -0.576891 -0.342960 0.233555 -0.690930 -0.106535 -0.405201 0.219462 0.218689 0.237502 0.238375 0.190000 0.189927 0.214235 0.217037 0.214127 0.333877 0.281409
chargesum: 0.00000
title: Mulliken charges with hydrogens summed into heavy atoms:
elementType: S O N N N C C C C C C C
charge: 0.203116 -0.161483 -0.026303 -0.013662 -0.001646 0.106328 -0.101014 0.036966 0.233555 -0.045531 -0.106535 -0.123792
polarizability: 1.78237498e+02 -4.08765109e+00 1.14027131e+02 -9.14751302e-02 3.57423781e-02 6.43893745e+01
1716.lowfreq: -11.1106 -6.1876 -5.5517 -0.0007 0.0018 0.0019 6.9852 29.5357 49.4471
frequency: -3.8693 24.4686 48.3402 64.1593 96.8053 114.4098 156.1006 217.6535 222.2435 266.7174 281.1632 302.7847 430.9348 517.9547 542.9685 558.0186 568.7975 579.6012 603.2596 661.5617 728.7705 754.9228 775.4968 797.7540 818.2315 872.2914 902.6441 924.6623 975.1989 1027.2710 1071.7307 1084.0301 1100.8073 1120.9881 1137.2402 1185.2201 1206.7261 1258.7361 1281.3580 1290.9746 1329.0727 1360.0136 1375.5554 1391.6654 1436.9720 1464.0089 1468.5224 1475.8931 1476.0395 1488.6072 1511.5940 1669.9262 2956.7465 2963.4459 2978.0243 3003.0918 3004.4077 3008.9896 3063.7795 3076.8258 3077.6685 3238.5243 3540.9683
redmass: 9.0145 2.5099 2.5150 4.9932 3.3481 1.8494 5.1735 6.3204 1.1334 4.6540 5.4101 5.9343 3.3569 4.1474 13.3861 4.7744 9.0105 3.1982 1.4788 6.8605 1.1029 1.2218 6.3344 1.2860 6.6526 5.9243 1.9639 1.3041 5.7549 4.5402 3.2100 2.0113 1.4670 3.5429 2.9359 1.2401 1.4618 1.4075 1.1796 1.0535 1.5122 1.6463 8.8704 1.2143 1.1451 1.5148 1.1189 1.0439 1.0607 1.0841 6.0498 6.7426 1.0590 1.0592 1.0360 1.0606 1.0980 1.1015 1.1031 1.1013 1.0995 1.0963 1.0772
irintensity: 1.0143 0.0696 0.4465 1.2508 1.3195 0.9378 1.9110 1.9172 0.2218 5.5547 2.7581 5.4750 6.3307 3.9910 24.3348 3.0805 19.2058 5.1082 90.0135 11.7893 15.2070 31.0800 1.4622 0.9769 17.1391 10.2336 17.7055 5.9081 37.8035 15.2062 39.4560 18.1875 0.0549 11.4585 193.7933 0.1095 0.1332 34.4481 0.2537 0.1652 17.3639 1.3755 22.7033 12.7747 81.4612 506.4361 59.5413 11.8021 2.7027 19.9674 234.6614 117.4690 13.2593 43.6418 32.8911 24.5713 18.7755 3.2717 6.8802 95.9527 48.7101 2.4764 30.8901
temp: 298.150 k
press: 1.00000 atm
elementType: 16 8 7 7 7 6 6 6 6 6 6 6 1 1 1 1 1 1 1 1 1 1 1
symmnumber: 1
zpe: 466144.9 jmol-1
zpe.correction: 0.177545 hartree
zpe.thermalcorrener: 0.189823 hartree
zpe.thermalcorrenthalpy: 0.190767 hartree
zpe.thermalcorrgfe: 0.136920 hartree
zpe.sumelectzpe: -909.927983 hartree
zpe.sumelectthermal: -909.915705 hartree
zpe.sumelectthermalent: -909.914761 hartree
zpe.sumelectthermalfe: -909.968608 hartree
dipole: -1.4366 -6.3423 0.0050
dipole: 6.5030
quadrupole: -69.0316 -87.8799 -79.0988
quadrupole: -6.0397 -0.0524 -0.0124
quadrupole: 9.6385 -9.2098 -0.4287 -6.0397 -0.0524 -0.0124
hfenergy: -910.1055277 hartree
pointgroup: C01 [X(C7H11N3O1S1)]
dipole: 0.6924869 2.4628601 -0.0226586 debye
dipolederiv: -0.4531001 -0.0503612 -0.0004621 0.1982442 -0.6229408 0.0098253 -0.0037135 0.009289 0.1139948 -0.6535705 -0.0033636 -0.0005797 0.5355498 -0.7940816 0.0042236 -0.0051884 0.0030682 -0.2728199 -2.3655069 0.2602289 -0.0047384 0.3562919 -0.418269 0.0017601 -0.0062432 0.0011151 -0.3273179 -0.4441728 0.1665812 -0.0029722 -0.4190569 -0.4808372 0.0037253 0.0041532 0.0049464 -0.1350551 0.0704829 -0.1577427 0.0027905 -0.0434056 -0.3946607 0.0032414 0.000649 0.0032963 -0.1388045 0.0429135 -0.0055314 -0.0001191 -0.0739743 0.0446465 0.0000809 0.00056 0.0007479 0.1454209 -0.3449526 -0.054569 0.0000268 -0.2792624 -0.0802069 -0.0003552 -0.0021754 -0.000893 0.1707238 0.0423676 0.0153075 0.0001411 0.0899343 0.1042598 -0.0003384 0.0003084 -0.0005249 0.1904216 2.0274779 -0.2119427 0.0050674 -1.003239 1.1233003 -0.0073604 0.0146264 -0.0057074 0.1943611 -0.0710933 0.043445 0.0001505 -0.0017335 0.0492371 -0.0001306 -0.0000306 -0.0000534 0.0890542 1.7345264 -0.2307398 0.0057636 0.2419245 0.6901634 -0.0088699 0.0019849 -0.0093513 0.0582893 0.0104199 0.2222953 -0.0024774 0.3269119 0.6715582 -0.0099023 -0.0039909 -0.0102667 -0.1672562 0.0535472 -0.0019598 -0.0022501 0.0154803 -0.006053 0.0978774 0.0136391 0.1020581 -0.0580018 0.0520728 -0.0018334 0.0022248 0.0153078 -0.0055489 -0.0980866 -0.0135239 -0.1025936 -0.0602608 0.0115511 0.0029167 -0.0190589 0.0391705 -0.0001514 0.0950753 -0.0311909 0.1150615 -0.0368903 0.0117942 0.0016705 0.0179186 0.0380429 0.0009726 -0.0943601 0.0314363 -0.1141154 -0.0371506 0.026047 0.0263819 0.0258499 -0.0043601 -0.047256 -0.1258255 0.0025742 -0.149859 -0.0947511 0.0258797 0.0266431 -0.0257676 -0.0044002 -0.049141 0.1260799 -0.0025353 0.1501707 -0.0928301 0.084366 -0.0032 0.0259172 0.0477658 -0.0121461 0.1184378 -0.0201213 0.1340533 -0.0827038 -0.1860094 -0.0895592 -0.0003461 -0.1299864 0.0095825 -0.0003506 -0.0004449 -0.0003374 0.1016333 0.0843463 -0.0030079 -0.0259134 0.0476362 -0.0103927 -0.1179702 0.0204557 -0.1336284 -0.0846884 0.19534 0.0358293 -0.0006115 0.0281448 0.1414462 0.0016553 -0.0014143 0.0020056 0.3135558 0.0452731 0.0125111 -0.0005536 -0.0209866 0.0865184 0.0015675 0.0001853 0.0015186 0.2110757 unknown
polarizability: 177.6493418|-7.3547218|114.6090713|0.2258296|-0.554561|64.39559 unknown
InChI: InChI=1S/C7H11N3OS/c1-2-3-4-6(11)9-7-10-8-5-12-7/h5,9H,2-4H2,1H3
charge 0 multiplicity 1
23 atoms
S  -3.251966 1.630097 -0.01924
O  0.495704 -1.400012 0.016573
N  -0.601756 0.689806 -0.000708
N  -2.413069 -0.938722 0.016137
N  -3.819195 -0.984172 0.013254
C  3.114526 -0.222045 0.002874
C  1.855317 0.665556 0.0060
C  4.416994 0.609242 0.005313
C  0.554613 -0.151791 0.008217
C  5.681181 -0.277313 0.001954
C  -1.937932 0.304186 0.001008
C  -4.395612 0.207509 -0.003617
H  3.091657 -0.890568 0.88394
H  3.091573 -0.885005 -0.882451
H  1.861308 1.3321 -0.882087
H  1.864384 1.329581 0.895981
H  4.432336 1.270979 0.895889
H  4.431979 1.277192 -0.880616
H  5.706397 -0.933369 0.891885
H  6.602713 0.332673 0.004143
H  5.70632 -0.926827 -0.892773
H  -0.418126 1.695392 -0.009378
H  -5.474444 0.355512 -0.007896
