program: Gaussian 09
title: 000287028
version: EM64L-G09RevD.01
frameworkgroup: C1[X(C16H12Cl4O)]
method: RPBEPBE
basis: SDD
operation: Freq
keyword: #p
keyword: freq=noraman
keyword: PBEPBE/SDD
title: #p freq=noraman PBEPBE/SDD
converged: YES YES NO NO
title: Mulliken charges:
elementType: Cl Cl Cl Cl O C C C C C C C C C C C C C C C C H H H H H H H H H H H H
charge: 0.037132 0.040231 0.056982 0.066908 -0.074391 -0.182305 -0.311665 0.114114 -0.338003 -0.354218 0.304433 0.235539 0.345005 -0.026606 -0.027410 -0.739978 -0.743557 -0.428220 -0.431724 -0.234573 -0.238686 0.288317 0.309471 0.229546 0.227147 0.224989 0.229855 0.210217 0.243863 0.263166 0.244725 0.231006 0.228688
chargesum: 0.00000
title: Mulliken charges with hydrogens summed into heavy atoms:
elementType: Cl Cl Cl Cl O C C C C C C C C C C C C C C C C
charge: 0.037132 0.040231 0.056982 0.066908 -0.074391 0.106012 -0.002195 0.114114 -0.338003 -0.354218 0.304433 0.235539 0.345005 -0.026606 -0.027410 -0.058296 -0.059622 -0.165054 -0.186999 -0.003567 -0.009998
polarizability: 2.05757986e+02 1.95357898e+01 2.19249828e+02 2.21358014e+01 -1.06139266e+01 1.66891646e+02
1716.lowfreq: -8.7307 -8.6134 -0.0021 -0.0016 -0.0012 4.3101 36.0659 59.9659 94.6642
frequency: 36.0420 59.9596 94.6632 97.1737 107.5286 114.4742 134.0000 152.3941 155.8233 158.9459 182.0907 203.8697 219.3170 229.0885 252.7772 255.4452 279.7808 292.4417 321.5802 331.4382 347.6824 367.6485 426.6356 433.6703 484.8522 505.5690 521.3946 534.8942 546.7762 582.4824 588.3886 628.4416 684.9173 698.4232 725.0728 742.7702 769.0693 771.3121 792.4176 799.6207 831.3910 878.1805 888.6695 909.6714 917.4181 937.0974 953.1488 961.5061 990.3435 992.3934 1001.7613 1022.2357 1026.4022 1038.1971 1073.8714 1086.4289 1119.8869 1141.0758 1157.4011 1173.5794 1179.9813 1192.2975 1207.9064 1240.8995 1266.9652 1277.7878 1293.4061 1328.6358 1377.1223 1385.3050 1403.4691 1445.1011 1462.6247 1465.9026 1473.7544 1479.8380 1490.8858 1569.0775 1594.6108 1613.1724 1748.6034 2973.5347 2991.4425 3018.9323 3033.7811 3071.8824 3076.8994 3081.8959 3110.2512 3124.5829 3135.1333 3146.9381 3164.6150
redmass: 6.2496 8.1768 8.7610 12.1197 4.6450 8.9464 7.6792 9.9982 27.5505 20.4384 4.6235 2.2962 3.9148 1.7385 4.0358 2.1248 1.4436 4.8862 4.9061 7.4776 17.6295 3.2875 3.9875 12.2875 6.2692 5.4440 4.0319 4.2207 4.0920 6.3444 6.5982 5.6784 6.7073 8.6272 5.1099 3.6556 5.8072 1.4945 5.8564 7.6308 4.3760 1.5047 6.1819 3.3140 2.3711 1.7719 1.6390 2.1935 5.5983 1.3947 1.6298 2.6542 2.4287 5.7646 2.6539 2.8087 1.8291 3.1868 3.3198 1.1152 2.0976 1.6201 2.4026 1.6598 1.9334 2.2952 1.7310 1.3336 1.1898 8.0352 1.2009 2.3382 1.0665 1.1287 2.0856 1.0548 1.1107 11.9262 7.2570 6.8118 13.0823 1.0346 1.0377 1.0852 1.0860 1.1005 1.0985 1.0987 1.0991 1.0861 1.0890 1.0947 1.1004
irintensity: 0.0090 0.0232 0.4530 0.0507 0.2537 0.5999 0.9289 0.2399 0.0482 0.1637 1.5504 0.1252 0.7751 0.4627 0.3181 0.0567 0.0673 0.4618 0.5865 0.2756 0.3844 0.7519 2.4396 4.4653 22.7856 3.3632 3.8407 0.6841 2.0401 2.9465 6.4255 22.9306 9.6735 32.2784 4.4757 11.5725 12.7714 54.8541 32.9688 22.6383 12.2454 0.2632 18.3786 2.9667 2.5776 1.4309 2.9559 4.4484 28.9358 1.4116 3.9629 1.6074 10.0091 1.8567 6.0300 9.0924 3.9945 12.3180 19.6185 0.7756 0.1735 0.4962 8.1236 26.3605 10.8288 19.2756 2.7185 2.0990 16.6109 5.4363 15.0156 8.9615 4.6851 3.0405 9.1171 15.4559 19.7216 52.9757 0.3428 1.2966 262.7223 24.3095 27.0868 3.0304 13.1284 24.0526 7.9642 42.1293 14.0863 2.5664 4.9892 20.2101 25.8350
temp: 298.150 k
press: 1.00000 atm
elementType: 17 17 17 17 8 6 6 6 6 6 6 6 6 6 6 6 6 6 6 6 6 1 1 1 1 1 1 1 1 1 1 1 1
symmnumber: 1
zpe: 611045.1 jmol-1
zpe.correction: 0.232735 hartree
zpe.thermalcorrener: 0.252057 hartree
zpe.thermalcorrenthalpy: 0.253001 hartree
zpe.thermalcorrgfe: 0.185408 hartree
zpe.sumelectzpe: -2530.827493 hartree
zpe.sumelectthermal: -2530.808171 hartree
zpe.sumelectthermalent: -2530.807226 hartree
zpe.sumelectthermalfe: -2530.874819 hartree
dipole: 4.1448 -2.1169 -0.2042
dipole: 4.6585
quadrupole: -154.1280 -146.1009 -149.2890
quadrupole: 1.5669 -1.7379 2.4173
quadrupole: -4.2887 3.7384 0.5503 1.5669 -1.7379 2.4173
hfenergy: -2531.0602278 hartree
pointgroup: C01 [X(C16H12Cl4O1)]
dipole: -1.7582278 0.5035835 -0.1192383 debye
polarizability: 200.8155977|16.9286335|224.7173121|-20.8311895|11.9292068|166.3665497 unknown
InChI: InChI=1S/C16H12Cl4O/c1-14(2)8-6-4-3-5-7(8)9-10(14)16(20)12(18)11(17)15(9,19)13(16)21/h3-6,9-10H,1-2H3
charge 0 multiplicity 1
33 atoms
Cl 2.691287 2.445995 0.349816
Cl 1.506458 -2.860086 -1.454748
Cl 1.453285 0.627279 2.974689
Cl 0.761291 -2.624114 1.857674
O  3.492767 -0.207195 -1.377217
C  0.432113 1.128479 -0.875409
C  0.061082 -0.372215 -1.27019
C  -0.895526 1.801385 -0.3562
C  1.685571 0.929386 0.061817
C  1.245925 -1.221503 -0.659004
C  -1.300213 -0.600219 -0.640118
C  2.411381 -0.183673 -0.79684
C  -1.795593 0.593107 -0.061443
C  1.415782 0.061919 1.28827
C  1.169233 -1.214875 0.863003
C  -1.517986 2.592995 -1.550694
C  -0.731071 2.764603 0.8412
C  -2.037724 -1.800707 -0.576451
C  -3.039336 0.591234 0.604403
C  -3.285038 -1.800592 0.091126
C  -3.779185 -0.612536 0.683235
H  0.812449 1.683137 -1.753074
H  0.066442 -0.526041 -2.364228
H  -1.640732 1.949306 -2.441061
H  -2.516013 2.979525 -1.276492
H  -0.878166 3.453053 -1.823591
H  -0.048048 3.59453 0.590578
H  -1.711285 3.204749 1.102582
H  -0.341102 2.257597 1.738039
H  -1.648777 -2.721318 -1.024419
H  -3.432497 1.506612 1.061381
H  -3.869219 -2.725006 0.156129
H  -4.742954 -0.626812 1.204438
