program: Gaussian 09
title: 000287014
version: EM64L-G09RevD.01
frameworkgroup: C1[X(C9H4Cl6O2)]
method: RPBEPBE
basis: SDD
operation: Freq
keyword: #p
keyword: freq=noraman
keyword: PBEPBE/SDD
title: #p freq=noraman PBEPBE/SDD
converged: YES YES NO NO
title: Mulliken charges:
elementType: Cl Cl Cl Cl Cl Cl O O C C C C C C C C C H H H H
charge: 0.089775 0.111613 0.134783 0.101465 0.108557 0.101840 -0.415653 -0.194604 0.519915 0.230444 0.648594 -0.462437 -0.321924 -0.290558 -0.827085 -0.819529 0.059260 0.291322 0.264358 0.278842 0.391024
chargesum: 0.00000
title: Mulliken charges with hydrogens summed into heavy atoms:
elementType: Cl Cl Cl Cl Cl Cl O O C C C C C C C C C
charge: 0.089775 0.111613 0.134783 0.101465 0.108557 0.101840 -0.024629 -0.194604 0.519915 0.230444 0.648594 -0.171116 -0.057566 -0.011716 -0.827085 -0.819529 0.059260
polarizability: 2.08155075e+02 7.07585251e+00 1.72751480e+02 5.11908062e+00 -1.69843622e+00 1.21312193e+02
1716.lowfreq: -3.5537 -0.0015 0.0017 0.0020 2.7747 6.1503 10.8067 35.6885 44.0312
frequency: 10.4817 35.6616 44.0281 57.8779 101.6330 113.5962 135.5164 144.0388 149.1359 180.9178 199.8748 202.2590 243.7936 252.6656 269.9716 279.0701 301.7939 344.0891 359.2439 377.8418 385.7279 406.0310 418.3459 507.0877 566.9179 596.6467 607.5154 622.9756 659.7656 699.9574 700.6155 726.9970 731.3274 770.7297 785.1865 830.8874 853.7562 931.2585 938.3161 975.2789 1004.6837 1109.4217 1184.6239 1198.7234 1213.7329 1281.0447 1307.5200 1371.0042 1383.8510 1477.3702 1563.2540 1604.7600 1655.8894 3161.8138 3187.8340 3191.4142 3516.9858
redmass: 21.8734 14.8446 11.0092 12.9234 14.5576 8.8440 8.0104 13.1857 28.3816 24.3450 19.8938 16.2519 21.7424 16.6568 20.9871 18.4447 13.7881 7.6750 29.5965 9.9793 6.5706 4.8452 8.6426 5.0255 3.6933 5.3305 1.6398 8.1474 5.1882 4.4979 8.4329 7.0321 8.3170 9.1741 3.8715 8.1937 1.6119 1.7183 5.0122 1.3783 4.0799 2.5681 1.4256 3.2611 2.5212 1.5280 2.0235 9.3385 3.4687 2.6057 7.7894 6.4830 9.6270 1.0901 1.0937 1.0925 1.0641
irintensity: 0.0334 1.2830 0.6503 0.8697 1.4652 0.1385 1.3393 0.1292 0.2326 0.8362 1.0477 0.7641 0.5812 0.1230 2.9355 0.5610 4.2180 2.1957 0.7584 12.7025 2.9306 4.7469 24.8553 18.9665 80.1358 49.3112 46.9799 1.4915 5.8818 375.2944 158.5499 39.4756 46.2097 36.6246 11.9635 161.1462 0.2498 17.9764 28.3321 1.1929 196.2997 104.4340 23.4805 26.1261 112.8005 18.2272 47.6542 5.5704 18.7748 2.4225 2.5122 3.2418 209.6252 0.2879 2.2501 1.7887 47.3827
temp: 298.150 k
press: 1.00000 atm
elementType: 17 17 17 17 17 17 8 8 6 6 6 6 6 6 6 6 6 1 1 1 1
symmnumber: 1
zpe: 286701.5 jmol-1
zpe.correction: 0.109199 hartree
zpe.thermalcorrener: 0.126898 hartree
zpe.thermalcorrenthalpy: 0.127842 hartree
zpe.thermalcorrgfe: 0.060043 hartree
zpe.sumelectzpe: -3254.907642 hartree
zpe.sumelectthermal: -3254.889943 hartree
zpe.sumelectthermalent: -3254.888999 hartree
zpe.sumelectthermalfe: -3254.956797 hartree
dipole: -1.1085 0.0897 -0.5669
dipole: 1.2483
quadrupole: -155.1709 -123.7472 -142.4575
quadrupole: 0.0334 -3.3783 -3.2663
quadrupole: -14.7123 16.7113 -1.9990 0.0334 -3.3783 -3.2663
hfenergy: -3255.0168404 hartree
pointgroup: C01 [X(C9H4Cl6O2)]
dipole: -0.4239465 0.0691288 -0.2380794 debye
dipolederiv: -0.2203895 0.0973204 0.0155807 0.0928517 -0.6986079 -0.1371548 0.0008779 -0.1207639 -0.1847327 -0.3944174 -0.092685 0.2203242 -0.1332295 -0.2983159 0.224567 0.208708 0.2232234 -0.440505 -0.4255708 0.029296 -0.2388908 0.0128051 -0.1167125 -0.045091 -0.2911752 -0.0693084 -0.6501036 -0.4794776 -0.0538791 0.2309984 -0.11954 -0.1943241 0.1879544 0.2993922 0.1520534 -0.6108791 -0.2367286 0.1272015 -0.0163006 0.1341615 -0.6649044 0.059544 -0.0176259 0.0607249 -0.1468883 -0.4572098 -0.0938852 -0.209137 -0.1689921 -0.2901543 -0.2759787 -0.2651282 -0.2339841 -0.5453867 -0.3555521 0.1631813 -0.0605582 0.1195363 -0.8652009 0.4330751 -0.0200086 0.4718862 -0.6841091 -0.7018554 -0.1012039 -0.2976978 -0.2481463 -0.6482537 -0.0686893 -0.1929961 0.0834643 -0.5491079 -0.1843057 -0.0170031 0.0034695 0.1684422 -0.0726569 -0.0049017 0.0657521 -0.0960426 -0.1568165 -0.1313686 -0.0420733 -0.017961 -0.2244945 -0.2022431 0.0571341 0.0097413 0.0369334 -0.0027522 -0.2374211 -0.0185536 0.0035892 0.1756623 -0.1989438 0.0155237 -0.0138959 0.0090013 -0.1589822 -0.1244269 -0.0440359 -0.0106246 0.0490328 -0.0488941 -0.0188815 0.0315032 0.0204071 -0.0721308 -0.2580662 -0.1747576 0.0099679 0.0163794 -0.0032651 -0.0344029 0.0171254 0.0016159 -0.0859955 0.0570352 0.1907528 -0.0137221 -0.0745629 0.0073838 -0.0160114 -0.0212913 -0.0086656 -0.0644162 1.2402295 -0.0830631 -0.0145894 -0.0622499 1.2297111 -0.0077513 -0.0370096 0.0101347 1.3497517 1.4614126 -0.0209041 0.0019589 -0.006772 1.2180727 0.024034 0.0026451 0.0159418 1.3844773 0.909069 0.222014 0.4670175 0.3808215 1.4190061 -0.3820178 0.3306679 -0.4709851 0.8869803 0.1471937 0.0431369 -0.0004894 0.0237839 0.0613146 0.0045056 -0.0202364 0.0007063 0.1371209 0.1224433 0.0348583 -0.009709 0.0189 0.0232894 0.0158113 0.0122237 0.0111883 0.1384217 0.0387084 -0.0567153 0.0102688 -0.0716738 0.0581073 0.0051016 0.0095096 0.0048856 0.1260256 0.2306979 -0.109002 -0.0734951 -0.0827157 0.2855917 -0.0363703 -0.1087792 -0.1024168 0.3300281 unknown
polarizability: 209.1208071|3.1186362|170.8314775|6.372127|-6.39994|122.2664633 unknown
InChI: InChI=1S/C9H4Cl6O2/c10-8(11,12)4-1-2-6(9(13,14)15)5(3-4)7(16)17/h1-3,16H
charge 0 multiplicity 1
21 atoms
Cl 2.886738 -2.906662 -0.356781
Cl 3.544975 -0.133687 -1.236825
Cl 3.340411 -0.800767 1.734998
Cl -4.02845 -0.577665 1.457508
Cl -3.674095 1.830126 -0.327107
Cl -3.939948 -0.915828 -1.550015
O  1.055099 2.783748 -0.973648
O  2.426973 2.071965 0.758538
C  1.10548 -0.731101 0.052448
C  0.62534 0.609787 -0.073509
C  -1.708512 -0.188145 -0.042686
C  -0.76843 0.855939 -0.147917
C  0.144932 -1.768905 0.167405
C  -1.23406 -1.511032 0.134122
C  2.588154 -1.090511 0.055497
C  -3.203195 0.043972 -0.1125
C  1.493781 1.83788 -0.035771
H  -1.103769 1.885497 -0.285928
H  0.485929 -2.800872 0.270587
H  -1.94099 -2.340389 0.229812
H  1.607738 3.607448 -0.885528
