program: Gaussian 09
title: 000287010
version: EM64L-G09RevD.01
frameworkgroup: C1[X(C10H17NO2)]
method: RPBEPBE
basis: SDD
operation: Freq
keyword: #p
keyword: freq=noraman
keyword: PBEPBE/SDD
title: #p freq=noraman PBEPBE/SDD
converged: YES YES NO NO
title: Mulliken charges:
elementType: O O N C C C C C C C C C C H H H H H H H H H H H H H H H H H
charge: -0.295499 -0.287168 -0.086698 -0.496694 0.260860 -0.289682 -0.695687 -0.235434 -0.139377 0.119945 -0.647565 -0.611355 -0.506052 0.190382 0.234565 0.245149 0.238053 0.208451 0.214277 0.233835 0.235774 0.242216 0.247796 0.228413 0.232892 0.232395 0.233347 0.222188 0.235268 0.235405
chargesum: 0.00000
title: Mulliken charges with hydrogens summed into heavy atoms:
elementType: O O N C C C C C C C C C C
charge: -0.295499 -0.287168 -0.086698 -0.071748 0.260860 -0.044533 -0.034906 -0.001599 0.096397 0.119945 0.070861 0.087279 0.186808
polarizability: 2.75791023e+02 -4.77536161e+00 1.17334474e+02 2.72308582e+00 -4.30040424e+00 7.86224938e+01
1716.lowfreq: -15.9413 -7.7072 -0.0005 0.0003 0.0008 5.0019 30.0158 44.2254 52.1796
frequency: 28.5019 44.2146 52.1319 73.2174 77.1589 95.1898 107.2547 134.8414 151.9282 169.2149 205.0238 213.9166 236.7907 249.8918 280.2443 288.2713 339.4987 386.9545 388.7090 432.4542 489.7290 554.7762 576.0691 655.6397 716.4442 749.3567 791.5564 828.7243 853.6543 905.5024 909.0224 970.7723 979.0133 1037.6088 1061.2769 1066.4344 1075.6156 1092.7979 1100.9742 1112.9843 1129.0723 1144.1199 1189.6449 1218.1405 1239.4561 1265.5982 1292.4853 1303.4141 1337.0230 1368.5743 1377.8914 1392.7598 1422.2461 1434.5385 1448.8782 1450.5460 1462.7015 1466.0699 1469.2214 1470.5010 1477.2330 1489.7326 1491.3109 1495.1683 1575.2772 1610.3027 1652.6536 2950.2960 2957.0054 2975.0242 2993.3804 2994.8772 3030.3874 3032.5522 3052.2215 3071.1780 3087.1220 3088.2964 3091.9144 3095.2604 3101.6093 3121.2057 3134.1458 3135.5995
redmass: 2.9415 2.6637 3.7657 3.3932 2.4115 1.5976 1.3252 1.7627 1.6179 2.3983 1.9890 1.2569 3.4722 3.6961 2.5047 1.9306 3.3100 3.5977 3.6639 2.6481 4.4464 4.0628 3.8084 3.0365 6.9243 3.5861 1.3747 1.7590 3.7037 1.3264 2.9913 1.8052 1.8953 3.1460 1.4860 1.8694 1.9691 1.2482 1.7905 1.2664 1.3598 1.4396 1.8803 2.6471 1.7304 1.3895 1.7308 1.3174 2.0405 1.4478 1.5162 2.5011 1.1991 1.1426 1.0508 1.2202 1.0473 1.0548 1.0453 1.0425 1.0635 1.0783 1.0573 1.1399 7.8404 6.2996 5.4568 1.0384 1.0400 1.0350 1.0618 1.0307 1.0978 1.0971 1.0977 1.0988 1.0940 1.0963 1.1038 1.0981 1.0981 1.0929 1.1041 1.0871
irintensity: 1.2030 1.8940 3.6474 0.6967 1.6929 1.2632 0.5642 0.8092 0.8040 1.6688 5.9458 1.0483 2.8497 3.1774 2.9714 5.4247 16.5480 3.2942 1.5331 5.3914 4.5313 1.6411 9.0003 6.2330 14.0489 20.1235 9.1127 17.0759 32.9382 23.1605 2.0291 35.4661 44.9377 42.6889 62.1153 69.7681 453.0302 1.4207 2.0603 0.6890 20.4173 79.3089 141.0448 184.5525 78.2412 24.8240 12.6266 15.2673 43.8205 15.5631 89.4883 155.9077 56.5842 22.4555 11.2780 12.9747 27.7918 17.2752 10.5222 5.5110 10.2636 16.0148 18.2411 50.4593 650.2325 5.1350 612.0179 64.5586 168.3369 46.1330 39.3230 57.6912 43.4490 30.2900 2.4456 58.4035 15.6888 17.9304 33.7344 7.2657 31.1606 4.0232 24.6421 29.7882
temp: 298.150 k
press: 1.00000 atm
elementType: 8 8 7 6 6 6 6 6 6 6 6 6 6 1 1 1 1 1 1 1 1 1 1 1 1 1 1 1 1 1
symmnumber: 1
zpe: 664346.1 jmol-1
zpe.correction: 0.253036 hartree
zpe.thermalcorrener: 0.269393 hartree
zpe.thermalcorrenthalpy: 0.270337 hartree
zpe.thermalcorrgfe: 0.207697 hartree
zpe.sumelectzpe: -595.405381 hartree
zpe.sumelectthermal: -595.389024 hartree
zpe.sumelectthermalent: -595.388080 hartree
zpe.sumelectthermalfe: -595.450720 hartree
dipole: 5.7587 1.6028 -0.0704
dipole: 5.9781
quadrupole: -48.8886 -81.4521 -82.1695
quadrupole: -3.8469 1.1802 -1.0030
quadrupole: 21.9481 -10.6154 -11.3328 -3.8469 1.1802 -1.0030
hfenergy: -595.658417 hartree
pointgroup: C01 [X(C10H17N1O2)]
dipole: -2.271538 0.6042513 0.0815773 debye
polarizability: 275.7121849|6.3925259|116.9331439|0.917378|6.1553719|79.1026622 unknown
InChI: InChI=1S/C10H17NO2/c1-5-9(10(12)13-4)7-6-8-11(2)3/h6-8H,5H2,1-4H3
charge 0 multiplicity 1
30 atoms
O  3.528369 0.133653 0.102579
O  2.402186 -1.846103 -0.407373
N  -3.842164 -0.250981 0.009211
C  1.261926 1.662986 0.481147
C  1.133415 0.188969 0.131114
C  -0.079535 -0.462601 -0.042374
C  1.430726 2.563965 -0.772475
C  -1.395152 0.10739 0.083347
C  -2.532401 -0.665786 -0.113658
C  2.345448 -0.623743 -0.087998
C  -4.146644 1.140096 0.367944
C  -4.958849 -1.122567 -0.382524
C  4.783949 -0.618097 -0.089702
H  0.371118 1.990513 1.050888
H  2.136132 1.809376 1.139249
H  -0.017101 -1.528821 -0.310052
H  2.350221 2.289479 -1.318845
H  1.506879 3.630087 -0.486615
H  0.574483 2.4491 -1.4624
H  -1.491003 1.17067 0.330351
H  -2.411701 -1.721501 -0.387696
H  -3.843718 1.846457 -0.432154
H  -3.61634 1.425212 1.296083
H  -5.229736 1.2493 0.539015
H  -5.730373 -1.150813 0.409944
H  -4.591745 -2.149895 -0.540831
H  -5.438382 -0.779535 -1.32212
H  5.583462 0.11388 0.097848
H  4.844664 -1.017434 -1.116941
H  4.844163 -1.461558 0.619739
