program: Gaussian 09
title: 000287098
version: EM64L-G09RevD.01
frameworkgroup: C1[X(C20H21N5O7)]
method: RPBEPBE
basis: SDD
operation: Freq
keyword: #p
keyword: freq=noraman
keyword: PBEPBE/SDD
title: #p freq=noraman PBEPBE/SDD
converged: YES YES NO NO
title: Mulliken charges:
elementType: O O O O O O O N N N N N C C C C C C C C C C C C C C C C C C C C H H H H H H H H H H H H H H H H H H H H H
charge: -0.301797 -0.275275 -0.271544 -0.226984 -0.258300 -0.209389 -0.272485 -0.238764 -0.011884 -0.435935 -0.055988 -0.621664 -0.133251 -0.188925 -0.116550 -0.057428 0.331943 -0.347619 -0.682849 -0.687804 0.397482 -0.247523 -0.158041 0.016993 0.147412 0.288592 0.361137 -0.322995 -0.387271 -0.203661 -0.193135 -0.242626 0.249851 0.311566 0.301216 0.287948 0.254044 0.248878 0.226514 0.224658 0.257958 0.244699 0.222895 0.224159 0.266839 0.350170 0.309634 0.355160 0.300273 0.265080 0.233742 0.236331 0.234511
chargesum: 0.00000
title: Mulliken charges with hydrogens summed into heavy atoms:
elementType: O O O O O O O N N N N N C C C C C C C C C C C C C C C C C C C C
charge: -0.301797 -0.275275 -0.271544 -0.226984 -0.258300 -0.209389 -0.272485 -0.238764 -0.011884 -0.085765 -0.055988 0.043131 0.116600 0.122642 0.184666 0.230520 0.331943 0.155304 0.026282 0.003948 0.397482 0.019316 -0.158041 0.016993 0.147412 0.288592 0.361137 -0.022722 -0.122191 0.030081 0.043197 -0.008114
polarizability: 3.07286248e+02 2.36493075e+01 2.50418848e+02 -9.81452407e+00 4.04630326e-01 2.60770614e+02
1716.lowfreq: -9.3522 -3.3464 -0.0007 -0.0002 0.0001 2.1513 9.0302 14.1262 18.2542
frequency: 6.6998 14.0570 18.1053 23.2511 29.3620 36.5102 65.0687 66.6170 72.3537 79.2240 113.0369 115.7295 122.5392 153.8310 165.3056 173.7377 190.1025 210.3513 233.6832 234.9259 244.7953 255.2642 258.2802 276.2588 298.8305 310.7516 319.1806 329.8127 331.3517 341.7684 354.7961 385.5315 409.2756 415.2503 440.2549 446.0200 477.0930 485.9130 495.6436 515.5099 530.4218 594.9007 603.8117 607.9530 612.7327 617.3605 626.6784 642.1813 644.5593 651.8825 656.8191 677.6949 691.2340 691.9345 714.6420 722.2982 730.0718 734.7329 762.9667 772.2424 776.0234 780.4657 817.9953 834.8875 841.5089 842.0508 858.5205 881.1562 903.0644 923.3140 925.5365 932.7889 942.2298 958.3398 972.6225 977.0808 987.1237 987.6368 995.8273 996.6162 1007.7528 1010.1460 1024.8238 1027.4579 1050.7312 1080.0774 1082.0737 1091.3224 1134.7225 1139.9053 1152.0286 1161.7344 1171.7868 1176.8281 1189.2040 1196.2742 1202.7742 1212.1186 1222.4928 1245.9471 1258.1489 1259.9611 1276.2867 1279.1883 1296.6364 1307.8724 1313.3584 1317.1620 1331.5953 1342.9084 1351.3046 1376.9883 1383.9240 1385.8090 1388.1484 1396.9455 1418.4051 1444.6527 1451.9316 1452.4342 1456.5511 1470.3782 1472.5724 1482.0579 1523.7050 1532.9464 1592.5606 1598.6191 1609.6428 1621.6684 1623.9140 1644.4482 2996.5940 3009.9425 3036.4626 3053.1152 3074.5941 3077.9835 3091.6568 3099.3363 3104.3521 3112.5612 3121.8265 3123.5898 3137.2786 3148.5195 3165.0146 3178.2158 3205.1017 3247.0697 3496.9785 3549.4279 3701.8797
redmass: 4.4826 6.0638 5.8624 5.7420 5.7139 5.7379 6.1627 7.7246 7.3975 5.9615 5.8741 6.5225 5.8881 1.9611 1.5817 6.2690 6.1658 4.3874 1.1094 5.9758 5.5045 3.9918 5.2354 1.2432 3.8325 5.5646 6.2513 3.7528 3.7385 6.5504 3.6294 2.6858 2.9341 5.1464 5.9184 4.0210 8.0303 4.5518 3.1434 6.7564 1.1577 5.8442 6.5022 2.9425 2.0279 2.3028 4.8154 5.1792 6.7586 9.5130 8.0613 11.9298 2.4115 7.5085 8.0074 4.7187 1.8018 4.0906 1.4652 5.7481 6.4323 6.8992 6.4908 3.0403 3.1118 1.5779 8.0996 5.9076 2.8895 1.3865 1.6158 6.1727 2.4482 2.4423 2.2454 1.3631 6.0982 1.3178 1.3195 6.0151 5.3219 5.3664 5.1247 2.4227 2.7820 2.5403 1.5089 2.5006 3.1767 2.2152 2.8223 3.4084 1.1060 2.5892 2.0720 1.9674 2.4307 2.0017 1.2839 1.5992 3.1112 1.6350 1.4082 1.5142 1.4189 1.4578 1.3165 1.6154 2.8974 1.2322 1.2949 1.3371 1.2814 8.4821 5.6352 1.2201 4.7408 2.2597 1.0504 1.0980 1.0475 2.2020 1.0683 1.0472 5.7339 3.9947 6.2250 1.6389 6.8694 8.1803 8.9459 3.8004 1.0352 1.0357 1.0608 1.0870 1.0872 1.0875 1.0882 1.0999 1.1009 1.0996 1.1066 1.1011 1.0857 1.0906 1.0955 1.0991 1.0947 1.0977 1.0788 1.0453 1.1050
irintensity: 0.5531 1.8159 1.6644 3.3215 0.6917 0.6588 2.9395 2.0398 1.3821 0.8412 9.1362 0.3023 4.8291 0.4979 1.4109 0.1556 2.7635 2.1163 0.5990 5.1810 2.3240 8.6601 2.9444 83.6484 9.1632 5.3297 0.8439 5.0112 4.5280 16.6553 6.3203 4.1380 0.0276 2.4094 11.3290 5.1646 7.5391 14.1621 10.0437 3.2999 234.9289 1.2140 1.6126 46.7335 61.7425 33.7409 6.2946 16.6544 2.0822 2.7935 1.1700 15.6200 29.6487 8.6680 28.9414 4.0265 22.2477 30.1935 92.3125 69.7052 37.8849 8.5111 29.0272 1.2271 18.3350 6.5283 8.2663 39.1844 42.4573 9.4223 0.7235 41.2519 22.6291 27.3569 40.2863 0.0628 16.2031 1.1946 6.7923 266.7759 52.0012 108.6918 70.8321 1.9056 57.8994 18.5330 14.1514 12.0591 4.9025 61.2936 171.1689 30.2820 49.0573 927.6325 100.6083 377.9034 37.8660 45.9907 6.3300 4.7161 78.1838 9.0976 3.7483 6.7318 9.3735 28.6882 1.1716 23.7934 38.2298 34.6030 2.7075 23.1122 34.9177 30.5091 139.6911 30.2036 36.1494 13.5144 6.0425 29.3129 3.4763 96.6471 0.7267 13.7517 332.2626 140.2814 33.0330 14.1030 34.0727 206.3137 597.3845 314.5744 12.5554 11.8613 18.3438 11.0937 7.9128 4.3093 16.3569 6.0557 10.1133 21.1920 3.9361 17.2690 0.0130 15.2174 21.9711 6.6930 4.6038 0.4427 106.3389 95.5546 44.8597
temp: 298.150 k
press: 1.00000 atm
elementType: 8 8 8 8 8 8 8 7 7 7 7 7 6 6 6 6 6 6 6 6 6 6 6 6 6 6 6 6 6 6 6 6 1 1 1 1 1 1 1 1 1 1 1 1 1 1 1 1 1 1 1 1 1
symmnumber: 1
zpe: 1052189.9 jmol-1
zpe.correction: 0.400758 hartree
zpe.thermalcorrener: 0.429634 hartree
zpe.thermalcorrenthalpy: 0.430578 hartree
zpe.thermalcorrgfe: 0.336416 hartree
zpe.sumelectzpe: -1572.691816 hartree
zpe.sumelectthermal: -1572.662940 hartree
zpe.sumelectthermalent: -1572.661996 hartree
zpe.sumelectthermalfe: -1572.756158 hartree
dipole: 6.0643 8.3803 7.1259
dipole: 12.5612
quadrupole: -193.0700 -206.3929 -177.8493
quadrupole: -41.5705 -37.7049 -17.5235
quadrupole: -0.6326 -13.9555 14.5881 -41.5705 -37.7049 -17.5235
hfenergy: -1573.0925741 hartree
pointgroup: C01 [X(C20H21N5O7)]
dipole: -2.3639252 3.0053635 -3.1309383 debye
polarizability: 306.7879702|-25.0834689|250.917996|-7.3511261|0.8092905|260.7697437 unknown
InChI: InChI=1S/C20H21N5O7/c1-20(2)31-13-11(8-28-19(27)29-10-6-4-3-5-7-10)30-17(14(13)32-20)25-9-22-12-15(25)23-18(21)24-16(12)26/h3-7,9,11,13-14,17,23H,8,21H2,1-2H3
charge 0 multiplicity 1
53 atoms
O  1.543865 1.137681 -1.243762
O  1.069195 3.848721 0.481379
O  -0.929968 3.191572 -0.582284
O  -1.574656 -0.923808 -1.149271
O  -3.726445 -1.252767 -0.811852
O  4.850827 -3.478059 1.95762
O  -2.433323 -0.368681 0.965702
N  2.55528 0.457666 0.829674
N  3.250993 -0.861715 2.57397
N  3.547082 -0.882178 -1.037187
N  4.750298 -2.857505 -0.31024
N  4.614478 -2.320677 -2.586465
C  0.945725 2.413324 0.721476
C  -0.369905 1.963084 -0.007394
C  2.089168 1.617819 0.040044
C  0.069189 0.928063 -1.073121
C  0.106001 4.258113 -0.592139
C  -0.207201 -0.547341 -0.704687
C  0.815043 4.329902 -1.951402
C  -0.551365 5.563842 -0.158636
C  3.2702 -0.612378 0.293788
C  2.591009 0.251067 2.242469
C  3.687825 -1.425709 1.356816
C  4.459046 -2.658792 1.086201
C  4.321272 -2.045462 -1.262048
C  -2.581759 -0.802467 -0.198792
C  -5.019533 -1.286247 -0.180973
C  -5.284164 -0.933639 1.160002
C  -6.034269 -1.728928 -1.055134
C  -6.619423 -1.033538 1.618073
C  -7.357334 -1.82042 -0.575943
C  -7.654833 -1.472376 0.763276
H  0.909145 2.264833 1.810632
H  -1.128842 1.547721 0.673152
H  2.935745 2.27847 -0.21445
H  -0.389574 1.150853 -2.050688
H  -0.094723 -0.748111 0.375215
H  0.453176 -1.207624 -1.287116
H  0.086263 4.599198 -2.735407
H  1.60217 5.103004 -1.921744
H  1.274967 3.361589 -2.210489
H  -1.032808 5.431975 0.822972
H  0.204858 6.363423 -0.085589
H  -1.315173 5.863976 -0.895749
H  2.139047 0.942035 2.948187
H  3.083505 -0.34208 -1.773784
H  4.463291 -1.6566 -3.341199
H  5.16044 -3.162433 -2.755277
H  -4.485839 -0.594488 1.821076
H  -5.773894 -1.992682 -2.084087
H  -6.842457 -0.764641 2.65617
H  -8.151284 -2.163407 -1.247476
H  -8.682127 -1.544381 1.13519
