program: Gaussian 09
title: 000287003
version: EM64L-G09RevD.01
frameworkgroup: C1[X(C9H10Cl2N4O)]
method: RPBEPBE
basis: SDD
operation: Freq
keyword: #p
keyword: freq=noraman
keyword: PBEPBE/SDD
title: #p freq=noraman PBEPBE/SDD
converged: YES YES NO NO
title: Mulliken charges:
elementType: Cl Cl O N N N N C C C C C C C C C H H H H H H H H H H
charge: -0.035686 -0.041359 -0.285367 -0.043559 -0.267478 0.027967 -0.650317 0.122700 0.292700 -0.314075 -0.200491 -0.108234 -0.234752 0.154570 -0.621371 -0.591441 0.311809 0.282712 0.232510 0.248210 0.269910 0.235518 0.273226 0.236635 0.388091 0.317574
chargesum: 0.00000
title: Mulliken charges with hydrogens summed into heavy atoms:
elementType: Cl Cl O N N N N C C C C C C C C C
charge: -0.035686 -0.041359 -0.285367 -0.043559 -0.267478 0.027967 0.055348 0.122700 0.292700 -0.002266 -0.200491 -0.108234 0.047960 0.154570 0.129259 0.153939
polarizability: 2.71310189e+02 -3.51789964e+00 1.68540943e+02 -3.35798382e+00 4.82055421e-02 7.19230823e+01
1716.lowfreq: -8.8739 -4.8581 -0.0010 0.0021 0.0030 4.0370 34.2783 40.9246 62.6235
frequency: 34.2680 40.8632 62.6170 78.5266 104.3795 115.5022 128.2126 159.3133 164.8589 186.2656 192.0915 219.5306 231.7592 297.2555 331.9019 352.6911 379.7908 398.0177 399.9334 411.0483 450.2576 469.0308 551.7254 560.9371 597.2687 599.1492 628.4811 695.2413 726.0944 768.2770 793.2522 827.6041 833.7726 868.5703 895.5628 943.7001 1035.9773 1051.9499 1074.2310 1082.0942 1115.1649 1130.0054 1130.6253 1185.8540 1197.2151 1281.4769 1318.2653 1324.1032 1353.2168 1364.9274 1393.3776 1404.2294 1416.0038 1440.1205 1449.3559 1468.5605 1481.0694 1494.8245 1544.3472 1556.6873 1578.0835 1620.5620 2975.1628 2980.7361 3058.0271 3064.6013 3116.7818 3130.7343 3168.2368 3181.5582 3252.1220 3615.1929
redmass: 7.7480 3.0506 4.4687 3.8713 3.5768 1.8060 1.2263 4.2736 11.3857 6.8483 5.7053 2.5352 5.5218 5.1999 12.7244 4.9587 7.9511 3.5091 7.1014 7.0288 4.5568 4.0759 4.6930 3.9422 1.4486 4.3053 5.6956 5.8068 9.4671 6.5096 6.0202 1.0921 6.4069 1.4008 5.3826 1.3729 1.4648 2.7871 2.0596 1.2502 3.6759 1.9693 1.4400 1.9187 2.4269 4.5556 3.0742 4.1937 4.5973 4.7379 4.0155 3.4791 1.1707 1.2416 1.0681 1.0498 1.0621 1.1575 7.6854 1.5400 3.9824 7.1258 1.0365 1.0366 1.1019 1.0960 1.1014 1.0984 1.0923 1.0936 1.0638 1.0894
irintensity: 0.8176 1.3765 2.2095 3.8535 1.0018 0.2521 0.1140 2.7472 1.8508 2.3886 1.5648 4.6072 2.9430 1.7568 1.7575 16.1863 8.4615 2.3167 3.7189 3.3648 11.9726 4.7828 24.7326 1.5554 136.2425 13.0743 31.3383 19.0021 66.5549 18.2607 6.1103 99.0535 8.8972 24.3204 16.2565 15.1169 6.4274 128.4243 43.1459 8.3229 9.2208 27.2189 3.1749 9.5831 1.6767 2.3322 93.3520 9.6365 195.9470 232.9466 52.3481 137.5383 25.3678 39.9588 15.1789 15.9990 4.6728 75.0533 90.0632 136.1344 129.9758 155.7441 24.1495 89.5264 26.5193 17.6993 13.1408 6.1040 10.8017 0.2070 277.6761 70.6742
temp: 298.150 k
press: 1.00000 atm
elementType: 17 17 8 7 7 7 7 6 6 6 6 6 6 6 6 6 1 1 1 1 1 1 1 1 1 1
symmnumber: 1
zpe: 487677.0 jmol-1
zpe.correction: 0.185746 hartree
zpe.thermalcorrener: 0.202228 hartree
zpe.thermalcorrenthalpy: 0.203172 hartree
zpe.thermalcorrgfe: 0.140242 hartree
zpe.sumelectzpe: -1562.092145 hartree
zpe.sumelectthermal: -1562.075663 hartree
zpe.sumelectthermalent: -1562.074719 hartree
zpe.sumelectthermalfe: -1562.137649 hartree
dipole: 8.5682 -1.4815 -0.4265
dipole: 8.7058
quadrupole: -85.0768 -114.5863 -108.2997
quadrupole: 11.2456 1.6677 -3.5146
quadrupole: 17.5775 -11.9320 -5.6454 11.2456 1.6677 -3.5146
hfenergy: -1562.2778915 hartree
pointgroup: C01 [X(C9H10Cl2N4O1)]
dipole: 3.3213971 -0.8166834 -0.1809054 debye
dipolederiv: -0.2161658 0.2670996 0.0351018 0.2092461 -0.6360537 -0.0134249 0.0265533 -0.0512737 -0.0531947 -0.9919099 -0.0979933 0.1008438 -0.1197696 -0.1354228 0.0171464 0.1185293 0.0163989 -0.0728985 -0.7487175 0.1522032 0.0801057 0.3779486 -1.0454853 -0.0106096 0.0621368 0.0348568 -0.3880448 -1.5436361 0.2245543 -0.1937173 0.0067696 -0.1951384 -0.0668911 0.25512 -0.0681283 -0.1517357 -1.2295428 0.1923293 -0.0055349 0.7479627 -0.4040936 0.0607877 -0.5457184 0.0690605 -0.2085377 1.9354473 -0.33321 0.1878834 -0.3841486 0.0211936 0.0481124 0.1276942 0.1125488 -0.1157703 -0.968826 -0.083818 0.1014021 -0.0869654 -0.5979614 0.0707585 0.1031129 0.0349361 -0.6697113 -0.0021366 -0.1737002 0.014888 -0.0196577 -0.3930275 0.0387735 0.0392424 0.0534003 -0.0005108 0.8428511 0.0087059 -0.0142412 0.1271493 -0.1636387 0.0083282 -0.0128981 0.0369622 0.0290437 -0.4089988 0.0201986 0.0290448 -0.2360826 -0.0953918 0.017442 0.0189866 -0.0045343 -0.0738758 0.1109177 -0.4400994 -0.0589859 -0.3445992 0.8474565 0.0635346 -0.0578173 0.0594784 -0.060205 1.3941038 0.1793343 -0.1781414 0.2464837 0.1220448 -0.0357367 -0.1986513 -0.0310597 -0.0526312 -0.3640536 0.0644553 0.0428794 0.0616657 -0.1701732 -0.0101676 0.0496067 -0.0121238 -0.0564737 1.2159678 0.1223755 -0.3026756 -0.1911865 1.4351502 -0.0994302 -0.2539057 -0.1431101 0.2928954 0.0910368 0.0379307 -0.0328125 0.0695556 0.2130899 0.0472579 -0.2593514 0.032936 0.1388744 0.3731902 -0.1474806 0.1727796 -0.3615005 0.2525749 0.0033282 0.3814878 -0.0037886 0.2301083 0.1128518 0.0287025 0.0000891 0.0791739 0.1468585 -0.0076185 0.0024986 0.0044378 0.1607701 0.0823986 -0.026769 0.0082335 -0.0400156 0.0266393 0.0127236 0.0157283 0.0097738 0.1634543 -0.1309997 0.0400616 0.0624504 0.0837871 0.0740929 -0.0098288 0.0481828 0.0083746 0.1213037 0.0650945 0.0315819 0.0155797 -0.1132282 -0.112019 -0.0221215 0.0865985 -0.0716974 0.0303877 0.1024012 -0.0145188 -0.1289542 -0.0402266 0.0658654 0.0024487 -0.0163406 0.0098693 -0.014921 -0.0789389 0.1113164 0.0151778 0.1679934 0.0087507 -0.0392415 0.0516612 -0.0933852 -0.0095271 0.090471 -0.0809411 0.0802884 -0.0202305 0.0699264 0.0690205 0.0295891 0.0574264 0.0581846 -0.0887703 -0.0113449 -0.117756 -0.0551069 -0.0179664 -0.0916777 -0.1868875 -0.0247373 0.0208672 0.190167 -0.0949468 0.0529716 -0.2069171 0.5577293 -0.0788275 0.0805628 -0.0537531 0.327638 0.1657974 0.0239729 0.0331 0.0418992 0.1249993 0.0259133 0.0342793 0.0171315 0.3545102 unknown
polarizability: 269.9709862|-11.0634472|167.4710409|-9.5540022|-13.2663331|74.3321871 unknown
InChI: InChI=1S/C9H10Cl2N4O/c1-15(2)14-13-8-6(9(12)16)3-5(10)4-7(8)11/h3-4H,12H2,1-2H3
charge 0 multiplicity 1
26 atoms
Cl 0.101992 -2.932944 -0.039978
Cl -4.854701 -0.612872 0.464035
O  -1.558986 3.434759 -0.241023
N  3.245134 -0.52935 0.154852
N  1.145849 0.12228 -0.296499
N  1.928216 -0.663186 0.42367
N  0.593935 2.706373 -0.725402
C  -1.134953 1.040683 -0.134983
C  -0.252539 -0.096025 -0.093421
C  -2.528305 0.873202 0.042687
C  -0.858588 -1.380665 0.065409
C  -3.062088 -0.406421 0.233437
C  -2.244629 -1.551426 0.229541
C  -0.713203 2.491627 -0.359527
C  3.775895 0.377681 -0.878177
C  4.14783 -1.315349 1.00537
H  -3.14765 1.774736 0.02774
H  -2.669144 -2.551953 0.341565
H  4.814681 0.088163 -1.101738
H  3.760029 1.430987 -0.536426
H  3.158447 0.300858 -1.789985
H  4.782337 -1.979149 0.38989
H  3.529644 -1.925348 1.680082
H  4.801263 -0.655237 1.606133
H  1.222501 1.885796 -0.781766
H  0.88733 3.664978 -0.909086
