program: Gaussian 09
title: 000287051
version: EM64L-G09RevD.01
frameworkgroup: C1[X(C17H27N7O)]
method: RPBEPBE
basis: SDD
operation: Freq
keyword: #p
keyword: freq=noraman
keyword: PBEPBE/SDD
title: #p freq=noraman PBEPBE/SDD
converged: YES YES NO NO
title: Mulliken charges:
elementType: O N N N N N N N C C C C C C C C C C C C C C C C C H H H H H H H H H H H H H H H H H H H H H H H H H H H
charge: -0.340410 -0.318426 -0.094636 -0.171779 -0.394884 -0.156334 -0.626247 -0.615107 0.194037 0.364468 -0.682261 -0.732196 0.207831 -0.499848 0.528008 -0.380276 -0.569166 -0.021826 -0.475019 -0.207951 0.328509 -0.347542 -0.405167 -0.656958 -0.647416 0.226431 0.234572 0.220679 0.239281 0.219173 0.233741 0.295502 0.262126 0.264847 0.221330 0.234543 0.227059 0.298206 0.332881 0.339821 0.258478 0.202451 0.218667 0.229139 0.314237 0.318825 0.249337 0.200710 0.215506 0.215905 0.228448 0.218702
chargesum: 0.00000
title: Mulliken charges with hydrogens summed into heavy atoms:
elementType: O N N N N N N N C C C C C C C C C C C C C C C C C
charge: -0.340410 -0.318426 -0.094636 -0.171779 -0.096678 -0.156334 0.046456 0.017956 0.194037 0.364468 -0.000580 -0.040002 0.207831 -0.204346 0.528008 -0.118151 -0.082989 -0.021826 -0.240476 0.019107 0.328509 0.113387 0.042639 0.008595 0.015638
polarizability: 2.90565420e+02 1.92302367e+01 2.62811276e+02 3.05063867e+00 1.16341254e+00 1.83779067e+02
1716.lowfreq: -21.3630 -12.8857 -7.7135 0.0003 0.0008 0.0009 3.0874 14.3891 19.5710
frequency: -18.8939 8.4183 19.5051 22.5576 38.2473 48.0794 74.6919 76.7447 89.1646 104.5501 109.4936 127.2351 158.2174 177.3447 187.7015 194.3066 212.7150 227.7204 241.6100 256.4269 264.0543 269.8573 282.4455 304.8483 314.2378 318.3401 322.1534 360.7213 363.5152 374.7400 391.2030 400.3401 422.7983 442.2205 458.1555 468.4591 487.6113 502.6702 517.9914 518.7561 522.8013 542.6112 552.8292 554.8448 580.4352 617.6893 651.5233 669.2700 684.6256 703.4199 715.1143 726.5327 751.5713 774.8858 790.1006 803.3254 813.8765 842.4721 865.1591 906.2231 911.8443 913.6261 929.2533 935.4699 946.3042 976.3005 981.4809 989.0374 996.2948 998.9614 1024.4539 1056.0647 1071.4147 1078.9490 1087.4978 1093.6832 1101.0053 1104.3500 1120.2202 1133.1936 1175.0354 1179.0472 1188.1030 1193.4333 1215.3438 1234.6811 1243.8187 1260.0812 1282.6649 1298.3669 1305.4923 1336.8514 1345.8083 1359.3473 1369.9780 1375.3789 1380.2889 1385.7107 1388.6765 1393.7911 1399.8125 1426.1142 1443.1013 1449.0272 1451.4376 1452.1419 1461.5300 1463.8837 1467.8383 1470.0941 1471.1253 1478.2533 1480.2879 1480.9736 1489.6160 1501.0415 1533.4628 1567.6001 1587.9841 1591.2138 1601.4319 1610.9679 1616.8360 2980.3984 2981.8748 2982.0418 2985.3649 2993.2860 2999.5059 3004.3550 3039.5507 3064.2006 3070.4427 3079.0359 3082.0270 3082.8535 3086.6292 3090.4942 3099.9550 3101.3051 3109.6807 3118.9979 3139.0555 3152.4576 3160.6871 3551.4988 3566.2375 3568.7429 3706.9895 3731.3614
redmass: 3.1987 3.7480 4.5629 4.0665 3.0232 4.5976 4.4075 3.9814 3.3099 4.8610 3.6793 4.0164 3.1305 2.3834 2.1382 1.8447 1.4718 1.2354 1.8175 1.7871 2.5242 2.2365 2.4416 2.5249 2.7318 2.9144 2.7988 1.6471 1.8597 2.8419 1.1923 2.5002 3.0701 2.5188 1.5112 2.9955 2.2561 2.2723 1.7255 2.6637 1.5142 3.4970 4.3657 3.2066 3.3799 5.1284 5.3304 7.5411 5.9298 4.8025 2.6717 10.0960 2.2952 1.1751 1.3059 1.6892 3.5355 5.0529 3.1487 2.2442 1.4849 1.5419 1.7834 1.7646 1.8067 2.8493 1.3591 2.7829 2.0634 2.0662 2.9421 2.8540 2.1040 1.9499 1.8695 1.7014 2.1868 1.9430 2.1420 2.0377 1.5228 1.3661 2.1691 3.2173 2.6689 1.3527 3.1241 1.4597 4.1615 1.3885 1.2888 1.2952 1.3318 1.2930 1.2194 7.0547 1.2192 1.3340 1.3668 1.4790 3.1929 3.1329 2.7404 1.3365 1.0769 1.0818 1.0925 1.0466 1.0527 1.0969 2.0916 1.1299 1.0725 1.0568 1.9578 1.0968 2.5161 1.8208 5.8025 5.0777 3.0218 3.4285 2.1396 1.0364 1.0362 1.0349 1.0617 1.0656 1.0352 1.0616 1.1000 1.0981 1.1008 1.0999 1.1005 1.0976 1.1006 1.0998 1.1016 1.1006 1.0994 1.0871 1.0916 1.0925 1.0985 1.0443 1.0768 1.0436 1.1053 1.1058
irintensity: 1.7777 0.6991 0.2460 0.8269 0.7777 0.1029 1.4706 9.0416 4.5585 3.8697 0.1395 1.0709 1.8826 1.5111 3.5339 2.1832 0.8317 0.4103 1.1008 1.9298 0.5962 0.3706 3.2691 7.9739 4.3606 0.9254 10.7303 176.1308 37.1855 22.6999 172.6393 14.0170 19.6860 38.8961 86.7525 29.6244 43.0646 7.5412 1.8617 1.2599 56.3852 11.1084 6.1925 5.7242 2.7895 3.3466 2.4295 8.0347 14.1203 23.5789 48.6419 19.8202 12.7509 4.6839 4.0448 27.2281 36.7577 2.0383 4.2469 3.8404 0.8391 3.4136 5.2429 0.2348 8.3197 6.2486 0.2926 2.0133 6.9759 0.8002 17.4421 11.9016 16.6370 7.4452 8.9129 20.1080 8.1382 2.0348 1.9367 27.5132 3.9608 2.5010 64.1072 49.6213 20.6661 4.8175 18.8968 175.2247 135.1720 24.3470 10.3531 10.0995 16.1182 8.1014 29.1063 27.1002 19.0769 32.8228 31.9141 30.4275 356.6017 66.6544 166.2735 23.9279 18.9501 21.6649 7.7129 8.9025 7.2500 12.1012 38.8858 42.5379 4.4366 10.2892 296.1524 21.5662 288.0672 220.3654 89.3328 239.0591 525.6783 147.6015 390.9302 27.5159 18.2812 21.5525 44.9312 31.9396 19.3645 49.5842 8.2643 13.3903 5.2364 63.5504 28.4134 31.5672 26.9005 14.7868 30.8073 33.1756 24.2897 5.9588 23.4384 1.1874 15.9464 57.3728 6.8247 85.4458 47.7762 35.9626
temp: 298.150 k
press: 1.00000 atm
elementType: 8 7 7 7 7 7 7 7 6 6 6 6 6 6 6 6 6 6 6 6 6 6 6 6 6 1 1 1 1 1 1 1 1 1 1 1 1 1 1 1 1 1 1 1 1 1 1 1 1 1 1 1
symmnumber: 1
zpe: 1140132.5 jmol-1
zpe.correction: 0.434254 hartree
zpe.thermalcorrener: 0.460385 hartree
zpe.thermalcorrenthalpy: 0.461329 hartree
zpe.thermalcorrgfe: 0.376247 hartree
zpe.sumelectzpe: -1120.628916 hartree
zpe.sumelectthermal: -1120.602785 hartree
zpe.sumelectthermalent: -1120.601841 hartree
zpe.sumelectthermalfe: -1120.686922 hartree
dipole: 2.9946 2.8810 2.4920
dipole: 4.8454
quadrupole: -130.4454 -136.3936 -153.9348
quadrupole: -6.6470 14.3089 -1.7154
quadrupole: 9.8125 3.8643 -13.6768 -6.6470 14.3089 -1.7154
hfenergy: -1121.0631698 hartree
pointgroup: C01 [X(C17H27N7O1)]
dipole: -1.1872822 -1.2708983 0.7805457 debye
polarizability: 291.0524003|19.1977051|260.3593553|-0.4790926|12.1820932|185.7440077 unknown
InChI: InChI=1S/C17H27N7O/c1-5-23(6-2)16(25)20-11-12-8-7-9-13(10-12)24-15(19)21-14(18)22-17(24,3)4/h7-10,20H,5-6,11,18-19H2,1-4H3
charge 0 multiplicity 1
52 atoms
O  -2.723759 0.48844 -1.693099
N  2.182401 -0.124035 -0.08966
N  3.052926 1.770199 1.251169
N  4.331328 0.82951 -0.621465
N  -3.092145 -1.304419 -0.238067
N  -3.995272 0.844745 0.240374
N  3.563482 -1.023028 -1.808561
N  5.309485 2.308762 0.895347
C  1.827433 1.15946 0.700027
C  1.332451 -1.285225 -0.111009
C  1.139392 2.169277 -0.260788
C  0.91292 0.803344 1.887742
C  3.366948 -0.076816 -0.822139
C  0.00709 -1.21275 -0.601669
C  -0.839179 -2.350423 -0.577279
C  1.826918 -2.525741 0.38175
C  -2.281682 -2.218139 -1.064805
C  4.157103 1.634383 0.527505
C  -0.333924 -3.581039 -0.094086
C  0.999328 -3.666615 0.375925
C  -3.243556 0.038355 -0.615256
C  -4.130253 2.279636 -0.101253
C  -4.690963 0.345754 1.443023
C  -5.405106 2.5865 -0.91578
C  -3.803238 0.3240 2.711803
H  0.965368 3.113758 0.284066
H  1.796393 2.386387 -1.121804
H  0.169897 1.793894 -0.635615
H  0.791812 1.71815 2.490519
H  -0.080931 0.448488 1.566929
H  1.38962 0.036821 2.522041
H  -0.381198 -0.274806 -1.011965
H  2.849795 -2.575768 0.769873
H  -2.301576 -1.798863 -2.086089
H  -2.770921 -3.209834 -1.085822
H  -0.97821 -4.46895 -0.081942
H  1.386391 -4.61906 0.755252
H  -3.297095 -1.596389 0.717064
H  4.453754 -0.993057 -2.29866
H  2.817441 -1.640162 -2.117704
H  -3.241344 2.564427 -0.688357
H  -4.121001 2.860009 0.841818
H  -5.109911 -0.659423 1.240764
H  -5.561042 1.004078 1.622116
H  5.285648 2.928123 1.699643
H  6.165058 2.136089 0.377068
H  -5.374097 2.04988 -1.879138
H  -6.31959 2.282041 -0.372968
H  -5.477427 3.670301 -1.123125
H  -2.92875 -0.34158 2.592286
H  -3.419261 1.335663 2.932845
H  -4.38315 -0.023052 3.586954
