program: Gaussian 09
title: 000287059
version: EM64L-G09RevD.01
frameworkgroup: C1[X(C25H27NO4)]
method: RPBEPBE
basis: SDD
operation: Freq
keyword: #p
keyword: freq=noraman
keyword: PBEPBE/SDD
title: #p freq=noraman PBEPBE/SDD
converged: YES YES NO NO
title: Mulliken charges:
elementType: O O O O N C C C C C C C C C C C C C C C C C C C C C C C C C H H H H H H H H H H H H H H H H H H H H H H H H H H H
charge: -0.300176 -0.301074 -0.298183 -0.299987 -0.129574 -0.172092 -0.585915 -0.474970 -0.389683 0.341936 0.079691 0.324195 -0.556198 0.307671 0.219901 -0.536125 -0.440712 -0.565417 0.517319 -0.495714 0.164997 0.197176 -0.562585 -0.617497 0.195251 0.200345 -0.530717 -0.530179 -0.530170 -0.528927 0.207853 0.214241 0.253075 0.235881 0.198884 0.196736 0.214797 0.212384 0.234973 0.254381 0.235280 0.258306 0.243039 0.261421 0.260146 0.253201 0.228000 0.221037 0.221937 0.253795 0.227764 0.228344 0.255727 0.222066 0.253217 0.222342 0.228582
chargesum: 0.00000
title: Mulliken charges with hydrogens summed into heavy atoms:
elementType: O O O O N C C C C C C C C C C C C C C C C C C C C C C C C C
charge: -0.300176 -0.301074 -0.298183 -0.299987 -0.129574 0.035761 -0.118598 -0.040204 0.021850 0.341936 0.079691 0.324195 -0.108841 0.307671 0.219901 -0.281744 -0.205431 -0.307111 0.517319 -0.252675 0.164997 0.197176 -0.301164 -0.357351 0.195251 0.200345 0.171521 0.173317 0.175967 0.175214
polarizability: 4.78078591e+02 -2.45934720e+01 2.84497553e+02 -1.79352357e+01 5.29756919e+00 1.74171338e+02
1716.lowfreq: -9.3648 -0.0011 0.0010 0.0013 0.9267 3.7528 19.3948 27.7184 44.4470
frequency: 19.2693 27.5391 44.4451 62.0311 67.9467 71.3869 89.1012 99.5541 102.1199 105.8856 131.4524 145.9086 151.1204 160.3066 162.3562 168.0228 174.8101 177.1995 193.1116 204.9943 212.4234 236.0413 252.2964 261.9753 277.9917 288.8040 308.8891 317.4771 333.5124 350.4680 376.2783 384.6902 403.0670 408.4104 425.0316 432.9858 464.3115 485.2983 493.5088 504.8095 522.2289 538.0959 545.2628 563.8994 603.0535 616.2436 632.1599 657.4696 687.4559 704.4856 715.4362 718.5255 729.4083 737.7279 740.6343 744.5269 770.4397 798.6884 814.3925 843.7594 880.9698 885.3350 887.5442 895.3124 905.1258 908.8463 918.9821 939.8974 955.1151 958.4771 969.1298 978.8739 990.9198 1008.6603 1038.6912 1072.7902 1078.0735 1083.6042 1099.4798 1111.1707 1112.7405 1114.0232 1114.5348 1135.1281 1147.5020 1149.3381 1153.6476 1155.6892 1156.0831 1172.8681 1179.7950 1181.0892 1191.7880 1194.2649 1209.7906 1213.5350 1230.6757 1241.2395 1243.9633 1263.0736 1269.0436 1274.4894 1285.1198 1306.6998 1320.6780 1325.3281 1334.7855 1356.4621 1370.5615 1381.0607 1389.4684 1397.3329 1417.0685 1420.8930 1422.8620 1425.4975 1440.1082 1443.0294 1445.0779 1446.5349 1456.4647 1456.8395 1458.0409 1458.5222 1463.5447 1472.0613 1477.2673 1477.3866 1481.5938 1487.1113 1487.2872 1489.8819 1498.9399 1570.9766 1579.3993 1609.3568 1618.6226 1634.7532 2792.5500 2800.1825 2851.6090 2969.0104 2969.4596 2971.0858 2972.4379 2980.8519 2981.1648 2990.5056 3026.4224 3037.9204 3038.9275 3065.1635 3066.3778 3067.4751 3070.6959 3115.7455 3118.4024 3118.8962 3119.8814 3121.1583 3137.9728 3141.0207 3141.3128 3146.0191 3159.1174
redmass: 4.9973 4.2207 4.4440 3.6470 3.9098 3.6277 3.6988 3.0690 3.2171 2.8299 3.8241 3.0925 1.5306 1.1575 1.2349 1.4269 2.1433 1.4602 3.4127 3.1139 3.2135 2.9045 4.7835 4.5151 4.8121 3.4313 3.8307 4.8637 4.1642 3.9051 5.0583 5.2248 4.4459 4.1566 3.5928 5.1873 5.3293 3.4603 3.5327 2.8939 4.4519 4.4912 3.7320 4.8845 4.3036 5.0967 4.5287 4.9081 5.5499 5.4140 4.3258 5.4580 4.3840 4.4574 3.2782 3.0138 2.8909 5.0319 1.4722 3.6023 1.8057 1.6621 1.8609 2.2794 1.7029 2.1228 4.3849 4.0550 4.2205 3.5957 1.6601 2.3140 2.3996 2.3349 2.6392 2.6208 3.0344 3.9101 3.5990 1.2704 1.2411 1.2505 1.2439 2.3222 1.4450 1.3742 1.4584 1.9243 1.4886 1.7634 1.8693 1.9706 1.4071 1.5751 1.5392 1.4804 1.1832 1.4465 1.4802 2.5984 1.7916 3.1189 2.0616 1.7588 1.6334 1.9239 1.6309 2.2921 5.2854 2.2345 2.3948 2.2872 1.6818 1.7775 1.1771 2.3560 1.1851 1.3996 1.1728 1.5340 1.0528 1.1170 1.1189 1.0661 1.2123 2.1441 1.0641 1.0579 1.1846 1.0629 1.0605 3.0857 3.8286 8.6138 7.7543 6.6043 7.2537 7.2680 1.0745 1.0760 1.0710 1.0309 1.0308 1.0311 1.0312 1.0603 1.0601 1.0842 1.0878 1.1008 1.1006 1.1036 1.1040 1.1038 1.1034 1.0864 1.1026 1.1028 1.1026 1.1029 1.0910 1.0973 1.0918 1.0920 1.0908
irintensity: 0.1029 0.0560 0.1855 1.6369 0.1427 6.0297 2.4354 1.1101 4.6079 12.0133 1.9010 2.2424 1.5563 0.0709 0.1131 0.7067 6.1494 1.4786 1.5335 4.1415 7.8019 3.6567 3.7719 10.0028 8.2960 1.5517 8.7292 5.0490 0.9111 2.2080 0.6238 2.4795 1.0523 3.7125 1.9190 17.0709 2.2751 7.0075 4.7773 2.6207 1.7585 0.8906 1.4181 3.5249 5.2459 12.5831 13.5415 5.7867 0.5168 1.7757 5.6059 13.7505 0.9034 20.6921 19.8760 7.5356 1.2668 5.0442 12.8473 5.7461 6.6296 11.7642 6.9656 2.5041 14.2089 76.1189 13.6615 49.8999 141.2051 15.8627 31.0469 3.0440 34.6907 17.4821 2.2224 2.3704 0.9475 30.7533 93.3927 14.4665 17.4788 0.7825 9.5105 35.1674 1.6322 16.2356 9.0243 13.8799 2.2386 79.6948 7.4527 39.0272 19.2932 21.8215 3.2651 16.3115 4.8876 55.9862 6.3644 142.5934 30.8199 140.5109 7.9568 11.6432 13.5451 11.9686 2.4804 35.1992 4.3045 22.1935 5.9281 12.4075 9.8877 5.5438 0.0778 21.2068 3.6384 4.3582 8.3551 22.6445 14.9354 22.0928 21.6955 5.6033 11.3584 72.8084 8.7426 2.6491 0.9285 22.1425 9.9207 209.7961 78.3597 0.3608 3.2537 18.4081 3.6097 11.9008 32.7458 88.1105 118.6756 83.6442 100.4938 76.0334 75.4067 25.7527 24.9224 19.5716 52.6836 20.8123 29.5703 31.7550 27.9685 24.0907 24.6198 5.6518 25.3302 30.6396 28.7948 26.6791 12.8538 20.7047 1.5056 13.2415 3.3250
temp: 298.150 k
press: 1.00000 atm
elementType: 8 8 8 8 7 6 6 6 6 6 6 6 6 6 6 6 6 6 6 6 6 6 6 6 6 6 6 6 6 6 1 1 1 1 1 1 1 1 1 1 1 1 1 1 1 1 1 1 1 1 1 1 1 1 1 1 1
symmnumber: 1
zpe: 1214269.5 jmol-1
zpe.correction: 0.462491 hartree
zpe.thermalcorrener: 0.490614 hartree
zpe.thermalcorrenthalpy: 0.491558 hartree
zpe.thermalcorrgfe: 0.403973 hartree
zpe.sumelectzpe: -1322.262958 hartree
zpe.sumelectthermal: -1322.234835 hartree
zpe.sumelectthermalent: -1322.233891 hartree
zpe.sumelectthermalfe: -1322.321476 hartree
dipole: 0.0285 0.5084 0.8344
dipole: 0.9775
quadrupole: -152.2092 -165.7462 -175.1919
quadrupole: -7.6185 -4.9063 -4.5369
quadrupole: 12.1732 -1.3637 -10.8095 -7.6185 -4.9063 -4.5369
hfenergy: -1322.7254493 hartree
pointgroup: C01 [X(C25H27N1O4)]
dipole: -0.0139505 0.1780685 -0.340604 debye
polarizability: 477.218308|26.9412034|284.2659488|-18.7922096|-12.7124203|175.2632256 unknown
InChI: InChI=1S/C25H27NO4/c1-27-22-10-16-6-5-15-9-21-19-13-25(30-4)23(28-2)11-17(19)7-8-26(21)14-20(15)18(16)12-24(22)29-3/h5-6,10-13,21H,7-9,14H2,1-4H3
charge 0 multiplicity 1
57 atoms
O  -5.87632 -1.997906 -0.584869
O  -7.142493 0.57786 0.0350
O  5.888462 1.811373 -0.818892
O  7.133714 -0.671333 0.066375
N  -0.652896 1.311338 0.118005
C  -1.376787 0.064465 -0.236764
C  -0.858407 -1.039899 0.717257
C  0.779716 1.23362 -0.229453
C  -1.290724 2.545862 -0.383787
C  -2.897123 0.224535 -0.161789
C  1.439602 -0.057528 0.236039
C  0.659163 -1.129072 0.69738
C  -2.658676 2.721515 0.294133
C  -3.512468 1.477933 0.102284
C  2.877757 -0.180421 0.187364
C  -3.71805 -0.905065 -0.401745
C  1.295034 -2.33454 1.14447
C  -4.924475 1.555694 0.172284
C  3.50531 -1.405281 0.64335
C  2.680113 -2.472135 1.127375
C  -5.121439 -0.820826 -0.351463
C  -5.735879 0.422914 -0.026547
C  3.72642 0.875615 -0.283953
C  4.929641 -1.533737 0.579779
C  5.114134 0.737173 -0.318741
C  5.728458 -0.500637 0.094878
C  -6.747371 -1.935634 -1.781752
C  -7.799932 -0.209864 1.103904
C  6.818276 2.412121 0.16744
C  7.719358 -0.676195 -1.295232
H  -1.119248 -0.245519 -1.286864
H  -1.287842 -2.021464 0.441002
H  -1.217982 -0.804216 1.737875
H  1.283344 2.099711 0.243287
H  0.941554 1.340341 -1.33757
H  -1.415641 2.533612 -1.49733
H  -0.630778 3.398204 -0.135921
H  -3.178214 3.607943 -0.117031
H  -2.492404 2.906584 1.373326
H  -3.281855 -1.878302 -0.652318
H  0.665155 -3.158495 1.501652
H  -5.419341 2.509362 0.388086
H  3.15384 -3.398397 1.472388
H  3.311386 1.828575 -0.625176
H  5.413342 -2.462504 0.90136
H  -7.454045 -1.088794 -1.713252
H  -7.290877 -2.892773 -1.7997
H  -6.131036 -1.83562 -2.695585
H  -7.460825 0.14149 2.096998
H  -7.581053 -1.28725 0.993615
H  -8.877937 -0.01978 0.987463
H  7.369603 3.188187 -0.38512
H  7.512553 1.65232 0.568588
H  6.245445 2.873053 0.994491
H  7.481926 0.260973 -1.83029
H  7.338781 -1.543249 -1.868001
H  8.805831 -0.772433 -1.1472
