program: Gaussian 09
title: 000287052
version: EM64L-G09RevD.01
frameworkgroup: C1[X(C21H24N4)]
method: RPBEPBE
basis: SDD
operation: Freq
keyword: #pfreq=noraman
keyword: PBEPBE/SDD
title: #p freq=noraman PBEPBE/SDD
converged: YES YES NO NO
title: Mulliken charges:
elementType: N N N N C C C C C C C C C C C C C C C C C C C C C H H H H H H H H H H H H H H H H H H H H H H H H
charge: -0.093738 -0.114671 -0.636942 -0.594618 -0.367830 -0.370595 -0.577678 -0.570263 0.500156 0.505209 -0.423617 -0.412853 0.275012 -0.431325 -0.384848 0.048230 -0.418416 -0.410359 0.094920 0.121020 -0.228118 -0.230322 -0.244186 -0.777300 -0.054601 0.211149 0.208751 0.208741 0.211060 0.207793 0.209315 0.206505 0.208360 0.233217 0.232034 0.262705 0.238000 0.230960 0.230271 0.222627 0.222557 0.226681 0.232643 0.246998 0.236282 0.342093 0.321588 0.322177 0.325225
chargesum: 0.00000
title: Mulliken charges with hydrogens summed into heavy atoms:
elementType: N N N N C C C C C C C C C C C C C C C C C C C C C
charge: -0.093738 -0.114671 0.026739 0.052784 0.052071 0.049207 -0.160569 -0.155398 0.500156 0.505209 -0.190401 -0.180819 0.275012 -0.168620 -0.146849 0.048230 -0.187456 -0.180088 0.094920 0.121020 -0.005491 -0.007765 -0.017504 -0.061376 -0.054601
polarizability: 4.14510280e+02 2.80883650e+01 2.09641126e+02 -1.97436455e+01 1.96876316e+01 1.80407114e+02
1716.lowfreq: -12.0909 -3.7262 -2.1297 -0.0011 0.0008 0.0010 11.5629 12.5396 17.4269
frequency: 10.6999 12.2885 17.1540 23.4876 47.6711 49.3965 55.8736 76.2818 89.4879 98.4429 109.9291 144.2933 170.4107 178.4875 204.0376 212.6969 252.1946 290.9488 307.5180 319.1256 330.3160 337.3351 359.1468 400.9199 403.1667 405.5900 428.5105 434.7699 445.9054 501.6254 513.1436 523.6861 529.5498 540.2074 554.7830 573.6081 587.2810 590.2373 617.7104 618.1995 636.9999 683.8547 705.3668 712.6399 738.2796 746.6183 759.2611 780.9095 784.4938 805.0862 811.7928 849.5242 853.1769 856.1022 892.8715 910.8391 915.9066 936.1132 962.2291 975.3121 977.7773 989.5828 989.9129 992.7607 1003.1724 1018.3504 1026.9837 1035.6198 1040.2848 1042.8667 1062.1966 1066.0989 1072.5522 1076.3470 1107.6843 1127.4225 1132.9791 1171.2146 1185.8631 1189.8989 1214.9124 1217.0803 1230.1072 1232.6310 1273.9830 1278.6045 1280.9329 1294.2117 1299.8864 1304.9070 1326.6897 1330.2715 1343.9918 1356.0359 1375.1890 1382.1261 1393.9059 1405.3726 1430.7027 1439.7656 1454.6751 1466.1505 1467.2336 1468.7397 1476.3314 1479.8284 1483.6933 1489.4659 1507.1461 1518.9235 1558.5344 1565.8833 1592.8089 1596.9600 1612.9938 1614.1150 1618.6506 2963.7383 2967.5252 2975.8362 2980.4595 2988.3280 3002.5518 3017.6960 3036.5329 3051.7542 3075.3461 3111.4156 3112.4037 3113.2855 3113.7068 3116.4569 3130.1817 3136.7845 3141.6190 3144.1037 3160.9145 3543.0461 3564.3026 3697.9767 3725.5371
redmass: 4.1403 4.5123 5.3473 3.4204 4.2580 4.0534 4.5720 4.8103 1.0693 2.5339 1.8507 3.9195 4.9335 4.5234 4.4140 6.4758 4.5696 4.1788 2.7711 2.6853 3.0156 2.4169 3.6073 3.5765 2.8178 2.7788 1.2994 2.3641 1.4477 3.3199 2.5220 1.2320 3.1492 1.2472 6.3776 3.5200 3.6290 3.4395 6.3334 4.6841 6.7875 5.0859 1.7280 9.2044 1.0809 4.0676 2.0141 1.2969 5.7293 3.4159 4.3113 1.7828 1.2478 1.2428 1.3600 3.6401 1.4588 2.1040 1.3504 1.3874 1.4144 5.0753 4.1573 1.3392 4.0860 2.4140 2.1770 1.5935 1.5775 5.4527 2.5315 2.0425 1.9282 1.8273 1.3158 1.2127 2.3046 1.0519 1.1128 1.1073 2.3085 2.2647 1.3855 1.4215 4.0743 1.2284 1.0690 1.4598 5.9306 1.4255 1.2660 1.4130 1.5338 3.4014 3.1754 7.8885 1.4908 3.1556 3.4645 2.1786 1.1209 1.0752 1.1049 1.2349 2.7160 1.1319 2.1888 1.1035 2.9474 4.4473 4.6059 6.2320 6.0488 1.4587 1.6435 5.9878 5.3677 1.0591 1.0590 1.0598 1.0591 1.0402 1.0983 1.1015 1.1043 1.1048 1.0922 1.0876 1.0870 1.0878 1.0868 1.1008 1.0907 1.0956 1.0958 1.0965 1.1014 1.0442 1.0438 1.1052 1.1059
irintensity: 0.0393 0.0406 0.0425 0.0198 0.2226 0.5744 0.0574 0.0884 0.0907 0.0583 0.0204 0.2933 1.0168 1.9956 8.6446 5.6431 0.5865 0.3909 6.8038 0.0172 5.6223 0.9781 4.5174 1.1374 0.0058 7.0673 66.6999 201.8944 222.7540 15.3541 3.9411 2.1401 6.0460 22.5624 2.4086 1.0784 14.6954 27.8354 0.1127 6.7647 2.3902 1.2900 54.1416 4.3581 4.2836 0.8137 43.5293 1.3852 13.0996 0.9089 4.7003 40.0711 0.0278 0.5567 0.1440 0.9992 3.0555 5.3010 0.2691 0.0262 1.7881 6.1563 10.5659 0.1841 0.1400 1.5660 9.9085 0.9379 5.2086 0.6902 0.1063 6.2699 3.1280 3.3334 1.1351 12.2642 4.6840 0.0967 0.1519 0.4843 0.1378 0.2524 24.9314 0.4955 1.7907 0.4438 0.0846 0.0740 37.6903 1.5116 0.3519 3.5153 0.1796 2.6981 3.0756 0.1228 24.4785 3.8445 92.4621 6.4216 11.2999 0.3162 5.1381 127.9760 76.2192 1.8306 20.7784 20.1427 19.2947 226.6357 362.1964 47.7846 1.4503 638.8552 309.7438 6.3621 29.4510 0.2988 1.2853 1.0768 135.0203 12.6861 0.3884 0.2272 0.1109 88.5748 14.6503 5.1469 11.7563 39.8132 8.2596 12.3227 10.7014 25.1475 47.9167 3.0815 27.6737 60.9111 133.5952 57.2282 42.7429
temp: 298.150 k
press: 1.00000 atm
elementType: 7 7 7 7 6 6 6 6 6 6 6 6 6 6 6 6 6 6 6 6 6 6 6 6 6 1 1 1 1 1 1 1 1 1 1 1 1 1 1 1 1 1 1 1 1 1 1 1 1
symmnumber: 1
zpe: 1066159.8 jmol-1
zpe.correction: 0.406079 hartree
zpe.thermalcorrener: 0.430045 hartree
zpe.thermalcorrenthalpy: 0.430989 hartree
zpe.thermalcorrgfe: 0.347507 hartree
zpe.sumelectzpe: -1031.889527 hartree
zpe.sumelectthermal: -1031.865561 hartree
zpe.sumelectthermalent: -1031.864617 hartree
zpe.sumelectthermalfe: -1031.948098 hartree
dipole: -1.0053 -1.6579 0.5055
dipole: 2.0037
quadrupole: -140.9783 -143.1200 -145.2548
quadrupole: -2.9337 -1.2574 5.4801
quadrupole: 2.1394 -0.0023 -2.1371 -2.9337 -1.2574 5.4801
hfenergy: -1032.2956059 hartree
pointgroup: C01 [X(C21H24N4)]
dipole: -0.3920013 0.679911 0.0742519 debye
polarizability: 414.2015563|-34.6421423|191.2375097|6.7871643|24.2082988|199.1194539 unknown
InChI: InChI=1S/C21H24N4/c1-15-19(20(22)25-21(23)24-15)18-13-11-17(12-14-18)10-6-5-9-16-7-3-2-4-8-16/h2-4,7-8,11-14H,5-6,9-10,22-23H2,1H3
charge 0 multiplicity 1
49 atoms
N  6.049562 -1.639869 -0.303876
N  6.546731 0.665082 0.348191
N  4.868022 2.254239 0.595707
N  8.245486 -0.918895 0.065756
C  -2.397767 0.053698 0.079471
C  -3.910036 0.360755 0.033115
C  -1.521297 1.321664 -0.123328
C  -4.786767 -0.911021 0.205687
C  -0.032836 1.009403 -0.103952
C  -6.275779 -0.606749 0.126916
C  0.732264 1.134112 1.083928
C  0.627018 0.534066 -1.267294
C  2.764766 0.313902 -0.054515
C  2.102445 0.793709 1.111065
C  1.996356 0.196599 -1.24585
C  4.214501 -0.040328 -0.025819
C  -7.026421 -0.319304 1.29635
C  -6.939393 -0.559331 -1.126991
C  4.711087 -1.337991 -0.329738
C  5.210101 0.947933 0.310842
C  -8.399239 0.008611 1.2173
C  -8.311458 -0.232599 -1.212464
C  -9.04715 0.054099 -0.038871
C  3.804168 -2.496254 -0.690851
C  6.900559 -0.619215 0.03519
H  -2.13774 -0.416317 1.049628
H  -2.144291 -0.690096 -0.703187
H  -4.162522 0.845105 -0.932223
H  -4.171188 1.092176 0.824602
H  -1.799039 1.78931 -1.089064
H  -1.768317 2.05449 0.669595
H  -4.50536 -1.639654 -0.580289
H  -4.544189 -1.380925 1.179186
H  0.247347 1.495603 1.999703
H  0.06249 0.43853 -2.203687
H  2.664359 0.873904 2.049366
H  2.487244 -0.151536 -2.161994
H  -6.531838 -0.358639 2.275338
H  -6.376408 -0.787149 -2.041295
H  -8.963278 0.223463 2.132346
H  -8.807422 -0.206039 -2.189657
H  -10.112071 0.304833 -0.102095
H  3.705207 -2.585605 -1.789579
H  4.256028 -3.433261 -0.327146
H  2.792797 -2.378385 -0.269721
H  3.901429 2.56563 0.551436
H  5.619442 2.909458 0.798223
H  8.91244 -0.192653 0.309122
H  8.54036 -1.86476 -0.158375
