program: Gaussian 09
title: 000287023
version: EM64L-G09RevD.01
frameworkgroup: C1[X(C12H7F15O2)]
method: RPBEPBE
basis: SDD
operation: Freq
keyword: #p
keyword: freq=noraman
keyword: PBEPBE/SDD
title: #p freq=noraman PBEPBE/SDD
converged: YES YES NO NO
title: Mulliken charges:
elementType: F F F F F F F F F F F F F F F O O C C C C C C C C C C C C H H H H H H H
charge: -0.125320 -0.113243 -0.122642 -0.138605 -0.116793 -0.119242 -0.125645 -0.130842 -0.125721 -0.118098 -0.153647 -0.152667 -0.120209 -0.123834 -0.130422 -0.264746 -0.233610 0.245072 0.197324 0.261069 0.257990 0.224174 0.227840 0.369223 -0.220300 -0.263547 0.252507 -0.233202 -0.668303 0.317559 0.289945 0.236744 0.236280 0.233571 0.233830 0.217512
chargesum: 0.00000
title: Mulliken charges with hydrogens summed into heavy atoms:
elementType: F F F F F F F F F F F F F F F O O C C C C C C C C C C C C
charge: -0.125320 -0.113243 -0.122642 -0.138605 -0.116793 -0.119242 -0.125645 -0.130842 -0.125721 -0.118098 -0.153647 -0.152667 -0.120209 -0.123834 -0.130422 -0.264746 -0.233610 0.245072 0.197324 0.261069 0.257990 0.224174 0.227840 0.369223 0.097259 0.026398 0.252507 0.239822 0.016610
polarizability: 1.63596547e+02 -2.88152670e+01 1.51028501e+02 9.19503656e+00 -3.41661254e+00 1.31709502e+02
1716.lowfreq: -4.2500 -3.1552 -1.4871 -0.0006 -0.0003 -0.0003 8.0208 14.8541 23.5261
frequency: 6.8330 14.7331 23.4886 29.5260 44.1482 51.3977 60.5699 65.1903 78.4080 85.0914 91.2739 98.0032 120.4636 145.1354 167.5194 168.1629 175.1417 189.6109 199.7177 206.7976 214.7735 226.2621 229.0426 235.0032 255.1381 261.1293 262.6008 265.7581 281.8782 293.1684 300.3858 306.2067 314.9564 325.5559 331.8099 341.1589 347.9824 366.0756 387.4725 418.0877 435.5672 461.5290 485.0715 493.4090 506.5469 516.7253 537.5027 560.7280 561.7906 588.6250 622.2797 644.8370 655.1471 676.9112 711.8659 761.4199 796.6900 825.4533 864.6315 887.9983 925.0520 937.4574 977.2000 993.5453 1004.2006 1007.9488 1014.7623 1019.8030 1021.6705 1027.5591 1037.2076 1043.0614 1053.0815 1075.4074 1081.7502 1090.1804 1113.8614 1119.1381 1131.0373 1134.7451 1141.5188 1168.2940 1189.6992 1197.5070 1200.6300 1250.6191 1271.2673 1296.1286 1357.9112 1402.9615 1463.8510 1470.4027 1484.4673 1618.4896 1678.5975 2999.3816 3012.5887 3072.6002 3096.4634 3111.2245 3150.8115 3176.3825
redmass: 3.9889 10.5588 8.3387 7.5219 11.7012 5.6500 15.0051 9.3676 4.6476 7.9158 6.9364 6.0171 17.7045 17.5665 11.9788 12.3620 6.9798 15.3852 1.7791 7.1594 13.6658 12.3514 11.3866 11.6520 15.0302 2.0556 10.4642 7.5733 15.7008 15.6273 14.4934 18.3274 16.8943 16.1568 16.6964 13.7898 4.8177 10.3840 6.4629 12.1759 15.6760 17.2480 8.2897 11.5778 12.2199 11.6933 10.1210 14.8789 14.9862 17.5735 11.7400 12.0331 14.2593 7.3553 11.2535 5.7129 1.1027 3.8723 10.4245 2.6860 6.1808 8.7852 9.1606 3.7265 1.3043 12.1457 9.5851 10.0303 2.7186 9.0710 11.3575 12.6916 12.8911 12.8159 12.5909 11.9933 2.3080 11.7935 12.1924 1.4701 3.0074 10.7038 8.9812 11.9847 5.7061 1.1327 1.6023 1.4974 1.4199 1.2615 1.0397 1.0664 1.0635 10.9055 6.8278 1.0359 1.0581 1.1068 1.0986 1.1027 1.0924 1.0930
irintensity: 0.4252 0.1321 0.0366 0.0285 0.0207 0.3743 0.0525 0.6968 0.2833 0.4685 0.5632 0.8420 0.4171 1.2438 4.4372 4.0481 1.7661 5.1035 1.7433 5.4713 3.0672 6.0194 2.9566 0.6122 0.5810 1.3898 6.2450 2.3864 2.4612 0.8949 2.9297 1.4349 0.5543 6.0757 0.7584 1.4987 5.9230 1.8855 2.2061 5.6430 0.1529 11.5962 16.9668 6.9791 6.4617 3.3612 7.9567 12.6029 13.2712 3.6889 11.1756 50.0018 24.4957 42.1079 146.3354 11.0106 4.4748 23.4176 60.4899 27.7172 84.1278 29.7898 60.6564 52.7371 45.4419 51.3692 18.1876 8.9198 96.0911 14.1343 174.2277 56.7788 177.2447 258.1552 239.6749 173.0063 15.8065 69.4839 23.7232 6.0870 197.8105 129.3504 25.0862 46.6840 7.9291 0.0741 176.5938 124.2960 2.5594 22.0625 12.9920 3.5337 15.5432 140.0915 0.8001 18.6506 12.6969 6.6131 24.7939 38.7090 4.3214 1.9176
temp: 298.150 k
press: 1.00000 atm
elementType: 9 9 9 9 9 9 9 9 9 9 9 9 9 9 9 8 8 6 6 6 6 6 6 6 6 6 6 6 6 1 1 1 1 1 1 1
symmnumber: 1
zpe: 497651.6 jmol-1
zpe.correction: 0.189545 hartree
zpe.thermalcorrener: 0.219688 hartree
zpe.thermalcorrenthalpy: 0.220632 hartree
zpe.thermalcorrgfe: 0.124515 hartree
zpe.sumelectzpe: -2107.252739 hartree
zpe.sumelectthermal: -2107.222596 hartree
zpe.sumelectthermalent: -2107.221652 hartree
zpe.sumelectthermalfe: -2107.317769 hartree
dipole: 3.3811 -2.7201 1.0005
dipole: 4.4533
quadrupole: -143.7424 -167.3717 -169.9526
quadrupole: -12.9518 7.0906 -2.2841
quadrupole: 16.6132 -7.0162 -9.5970 -12.9518 7.0906 -2.2841
hfenergy: -2107.442284 hartree
pointgroup: C01 [X(C12H7F15O2)]
dipole: 1.3443622 0.9977516 -0.5165692 debye
polarizability: 164.521841|27.4940988|148.5492648|-12.4647457|-5.3785614|133.263445 unknown
InChI: InChI=1S/C12H7F15O2/c1-2-29-5(28)3-4-6(13,14)7(15,16)8(17,18)9(19,20)10(21,22)11(23,24)12(25,26)27/h3-4H,2H2,1H3
charge 0 multiplicity 1
36 atoms
F  -2.688709 -1.251171 0.668589
F  -2.299092 -1.809141 -1.514931
F  0.14223 -0.699532 -1.541819
F  -0.171281 0.374747 0.445718
F  -4.082528 0.089475 -1.347704
F  -2.12412 0.88335 -2.227215
F  -0.563046 -3.203087 0.100151
F  -0.189868 -1.826008 1.888624
F  -3.8158 2.620622 -0.822775
F  -1.66048 2.477522 -0.114108
F  1.920576 -2.685957 -0.944929
F  1.956278 -3.34277 1.245282
F  -3.68275 2.928392 1.846418
F  -4.578762 0.894992 1.393064
F  -2.439697 1.062331 2.15537
O  4.95003 1.177948 -0.686429
O  4.202577 1.174309 1.531605
C  -2.045059 -0.836858 -0.523081
C  -0.490552 -0.800491 -0.282627
C  -2.761418 0.484177 -1.028571
C  0.099265 -2.027368 0.513562
C  -2.890836 1.79273 -0.140649
C  1.657023 -2.235233 0.379624
C  -3.407361 1.656981 1.337474
C  2.502511 -1.061454 0.766867
C  3.342475 -0.440034 -0.095925
C  4.180903 0.701829 0.36937
C  5.854113 2.333883 -0.375564
C  6.583293 2.682791 -1.66715
H  2.429093 -0.734554 1.810651
H  3.438537 -0.743671 -1.14261
H  5.228715 3.162927 0.001915
H  6.539028 2.021488 0.433317
H  7.18305 1.82951 -2.026382
H  5.870354 2.967585 -2.459287
H  7.263709 3.535242 -1.489943
