program: Gaussian 09
title: 000287008
version: EM64L-G09RevD.01
frameworkgroup: C1[X(C16H18N2O2)]
method: RPBEPBE
basis: SDD
operation: Freq
keyword: #p
keyword: freq=noraman
keyword: PBEPBE/SDD
title: #p freq=noraman PBEPBE/SDD
converged: YES YES NO NO
title: Mulliken charges:
elementType: O O N N C C C C C C C C C C C C C C C C H H H H H H H H H H H H H H H H H H
charge: -0.336703 -0.319261 -0.193162 0.026921 -0.471464 -0.405038 0.294374 -0.180862 0.346681 -0.441727 0.334522 0.437652 -0.055362 -0.703707 -0.713453 -0.713436 -0.405760 -0.325298 -0.247835 -0.225515 0.255266 0.255227 0.257248 0.257270 0.256761 0.226495 0.226491 0.203996 0.271427 0.207878 0.217566 0.217610 0.207893 0.271351 0.235881 0.265502 0.231144 0.233425
chargesum: 0.00000
title: Mulliken charges with hydrogens summed into heavy atoms:
elementType: O O N N C C C C C C C C C C C C C C C C
charge: -0.336703 -0.319261 -0.193162 0.026921 0.039029 0.109481 0.294374 -0.180862 0.346681 -0.184966 0.334522 0.437652 -0.055362 -0.046725 -0.016582 -0.016581 -0.169879 -0.059796 -0.016690 0.007910
polarizability: 3.10934267e+02 -8.12004838e+00 1.84283481e+02 -4.42396653e-02 -2.92275579e-02 1.05630050e+02
1716.lowfreq: -6.9303 -4.0169 -2.7315 -0.0008 -0.0001 0.0006 18.6025 44.5569 62.9383
frequency: 18.3464 44.5196 62.9368 65.2954 115.5314 123.9271 154.0871 170.2093 184.0310 199.2245 202.7039 235.9056 237.1175 265.1849 282.4976 290.0913 305.6353 331.0196 365.7988 398.1413 412.0078 425.2283 434.3830 480.3492 489.2981 531.0056 535.6454 576.1852 613.7549 667.2172 701.2151 702.5888 719.9060 737.0401 748.3701 766.4527 796.9816 812.8941 823.9761 851.0607 876.8600 891.1116 911.0415 913.1134 920.3609 955.1759 968.4406 991.8741 996.8650 1016.3359 1017.9213 1030.1549 1030.7656 1048.4602 1097.2784 1139.3879 1155.3460 1167.3902 1167.6802 1168.8020 1176.6476 1212.6320 1237.3970 1256.6041 1259.0399 1267.1078 1289.2157 1301.9265 1324.5846 1369.5741 1373.3759 1376.4920 1393.6322 1396.8033 1404.6797 1416.5606 1444.5641 1462.2274 1465.7934 1466.4687 1469.1859 1475.2841 1478.5816 1484.3562 1500.8699 1502.8898 1561.5515 1622.4045 1625.7463 1634.1535 2973.9685 2986.8330 2988.6313 2991.2095 2994.2268 3014.4325 3036.5538 3078.7847 3082.2072 3095.4036 3097.2512 3111.9734 3116.3714 3121.1924 3129.1523 3138.0248 3155.8859 3170.7991
redmass: 3.9423 3.3706 4.4923 5.1358 3.3005 4.6166 1.8870 1.4715 4.1534 4.7555 3.1753 1.0834 1.0467 3.1714 4.5477 3.4944 3.7297 2.5682 3.4173 3.6802 3.1886 3.6961 2.8742 2.9066 3.4506 7.0784 3.2825 5.4488 7.0565 3.3923 10.9934 7.7121 5.6633 5.7937 6.3027 1.2715 2.7740 3.7384 4.1398 4.0084 1.4628 5.7949 1.5867 1.5985 1.6189 1.2029 1.3870 1.6417 1.3344 1.9020 2.1731 1.4216 1.4224 5.9631 2.5172 2.1935 1.0961 1.9009 1.5325 1.0755 2.1328 1.6945 2.4791 3.0190 2.7750 2.9444 2.0911 1.8678 1.9331 3.4008 1.2293 1.4365 3.6997 1.2877 3.0050 4.6153 1.0468 2.8601 1.0790 1.0562 1.0770 1.1210 1.0516 1.0985 1.1475 2.9476 8.2451 6.7815 8.7991 8.3847 1.0584 1.0361 1.0357 1.0587 1.0365 1.1037 1.1041 1.0994 1.0991 1.0991 1.1003 1.1004 1.0995 1.0876 1.0929 1.0889 1.0946 1.0996
irintensity: 0.1813 0.1028 0.6151 3.6997 0.1159 5.8760 0.4348 0.4394 4.0693 0.0767 7.9949 0.2585 0.1500 1.2742 5.0488 1.6000 14.8808 2.0293 1.6589 0.0029 2.0275 0.4666 2.2418 8.1873 0.1632 5.2611 0.1397 12.4618 1.0842 0.1948 22.3024 2.6342 2.8228 3.8228 0.7321 71.4866 6.7966 0.0009 0.2898 62.0180 12.7103 0.0007 14.6803 0.9524 0.9146 0.3018 4.5996 4.3685 0.0371 0.9424 4.2901 4.5453 0.0071 361.4151 5.4430 11.6703 0.6306 11.8605 77.1547 0.1362 207.3708 0.1460 4.8368 26.8674 15.8771 65.0334 55.8612 27.5268 15.6126 313.7594 44.4201 142.0232 16.1766 51.7920 13.4216 19.2895 0.9482 13.3107 6.2302 1.6645 38.6294 12.8284 4.1875 19.9564 49.9614 2.1049 2.8185 24.4946 359.3634 61.1014 29.4423 27.1484 11.7454 13.4831 35.8133 13.0974 14.3967 10.8037 22.0979 68.7787 31.9197 4.0555 15.0252 3.0715 9.2451 11.1286 23.4294 24.6326
temp: 298.150 k
press: 1.00000 atm
elementType: 8 8 7 7 6 6 6 6 6 6 6 6 6 6 6 6 6 6 6 6 1 1 1 1 1 1 1 1 1 1 1 1 1 1 1 1 1 1
symmnumber: 1
zpe: 806733.9 jmol-1
zpe.correction: 0.307269 hartree
zpe.thermalcorrener: 0.325657 hartree
zpe.thermalcorrenthalpy: 0.326602 hartree
zpe.thermalcorrgfe: 0.260380 hartree
zpe.sumelectzpe: -879.032837 hartree
zpe.sumelectthermal: -879.014449 hartree
zpe.sumelectthermalent: -879.013505 hartree
zpe.sumelectthermalfe: -879.079726 hartree
dipole: -1.5984 -0.0061 0.0022
dipole: 1.5985
quadrupole: -96.3370 -117.1679 -119.7831
quadrupole: 13.0949 -0.0035 0.0000
quadrupole: 14.7590 -6.0719 -8.6871 13.0949 -0.0035 0.0000
hfenergy: -879.3401061 hartree
pointgroup: C01 [X(C16H18N2O2)]
dipole: -0.6288693 0.0036332 -0.0008624 debye
polarizability: 310.9660922|7.8679569|184.2511822|0.0181729|-0.1958708|105.6305233 unknown
InChI: InChI=1S/C16H18N2O2/c1-16(2,3)20-15(19)18-9-12-8-11-6-4-5-7-13(11)17-14(12)10-18/h4-8H,9-10H2,1-3H3
charge 0 multiplicity 1
38 atoms
O  3.350119 -0.48425 0.002153
O  3.209773 1.89416 -0.004033
N  1.317878 0.536419 0.000858
N  -1.817358 -1.296725 0.004156
C  0.384415 1.693896 -0.00264
C  0.652632 -0.788437 0.004089
C  -0.969815 1.020761 -0.001544
C  -0.815895 -0.409846 0.002325
C  4.873262 -0.51693 -0.000266
C  -2.250962 1.558558 -0.003617
C  2.676867 0.747151 0.000399
C  -3.371323 0.658348 -0.001822
C  -3.109452 -0.771287 0.002086
C  5.157078 -2.029229 0.002658
C  5.398986 0.154596 -1.285139
C  5.403259 0.160388 1.279798
C  -4.728787 1.114228 -0.00374
C  -4.210806 -1.683116 0.003887
C  -5.785857 0.200498 -0.001904
C  -5.524798 -1.206819 0.001927
H  0.552597 2.330004 -0.893494
H  0.551713 2.334651 0.885046
H  0.927302 -1.382928 0.89548
H  0.928204 -1.387743 -0.883789
H  -2.424994 2.641109 -0.00656
H  4.720589 -2.508587 -0.890545
H  4.724541 -2.50445 0.899988
H  6.24736 -2.206803 0.000671
H  5.159615 1.229475 -1.291376
H  6.496378 0.032643 -1.341172
H  4.953914 -0.319959 -2.177831
H  4.960447 -0.309506 2.176069
H  6.500714 0.037836 1.333182
H  5.164681 1.235462 1.281639
H  -4.927473 2.192967 -0.006685
H  -3.982738 -2.753378 0.006816
H  -6.82128 0.558018 -0.003391
H  -6.363588 -1.911378 0.00332
