program: Gaussian 09
title: 000287000
version: EM64L-G09RevD.01
frameworkgroup: C1[X(C9H12N6O3)]
method: RPBEPBE
basis: SDD
operation: Freq
keyword: #p
keyword: freq=noraman
keyword: PBEPBE/SDD
title: #p freq=noraman PBEPBE/SDD
converged: YES YES NO NO
title: Mulliken charges:
elementType: O O O N N N N N N C C C C C C C C C H H H H H H H H H H H H
charge: -0.251071 -0.436303 -0.456095 -0.174240 -0.045810 -0.088964 -0.031736 -0.068059 -0.602848 -0.104987 -0.078877 -0.506345 -0.046910 -0.403079 0.183523 -0.139299 0.216051 -0.337561 0.218677 0.265979 0.281159 0.251092 0.244376 0.234432 0.229531 0.350735 0.356425 0.249158 0.350360 0.340686
chargesum: 0.00000
title: Mulliken charges with hydrogens summed into heavy atoms:
elementType: O O O N N N N N N C C C C C C C C C
charge: -0.251071 -0.085568 -0.099670 -0.174240 -0.045810 -0.088964 -0.031736 -0.068059 0.088198 0.113690 0.187102 0.025906 0.197465 0.060885 0.183523 -0.139299 0.216051 -0.088403
polarizability: 2.13223749e+02 8.90931125e-02 1.43784642e+02 8.35053380e+00 1.32692882e+00 9.29719817e+01
1716.lowfreq: -13.9794 -0.0004 0.0009 0.0010 2.5639 6.1216 27.4357 30.8613 55.0807
frequency: 26.4391 30.8390 55.0698 97.4004 132.2520 135.7496 149.9970 186.6222 221.2258 240.5777 267.6554 281.0090 285.2189 328.6661 338.4920 364.4917 465.2624 503.6117 513.0273 535.4845 538.7846 555.7236 557.7903 558.6133 577.9529 613.1997 651.9098 664.3228 682.3676 703.3600 723.4044 806.2816 827.9150 860.6219 869.1889 907.2478 936.0615 941.6671 950.2453 960.4233 985.4109 996.8483 1030.7482 1058.0213 1061.5315 1068.4965 1134.5131 1148.2528 1179.2380 1190.2761 1214.6531 1232.0496 1253.7000 1257.6006 1279.6365 1282.0491 1288.5624 1312.6036 1320.9877 1322.0989 1356.3551 1357.7815 1378.3614 1383.5049 1401.0566 1412.7370 1447.1156 1467.4131 1474.1467 1542.5167 1577.0017 1635.7708 2951.1016 2975.9913 3011.5766 3044.7327 3069.5491 3099.8463 3118.5505 3170.7377 3480.4451 3534.1361 3575.7836 3688.3962
redmass: 7.2212 5.9501 5.6613 4.5716 4.7913 4.2456 6.4443 5.9735 5.0803 4.4253 2.0748 3.4896 1.8947 4.2166 2.7402 4.9471 5.3064 8.7646 3.8223 2.7858 1.2826 1.2826 1.5585 1.8160 4.8982 7.8136 5.2164 6.9800 10.8048 7.0670 6.8291 11.9445 2.2140 7.6695 8.0432 2.4281 3.9748 1.4443 4.5437 2.4983 2.0426 5.1248 2.8037 1.8770 2.7665 4.6193 1.6393 2.5124 4.8091 4.2646 1.7637 3.1819 1.2064 1.2270 2.0659 1.1902 2.2933 1.2247 1.3954 4.5221 1.4516 1.4240 1.3862 1.4743 1.6160 5.3012 3.3283 1.0942 1.0826 8.8224 2.0026 2.4163 1.0834 1.0859 1.0627 1.0601 1.0887 1.1040 1.1052 1.0924 1.0653 1.0447 1.0666 1.1056
irintensity: 0.3594 0.3865 1.4717 11.3997 4.2316 1.4296 15.4254 1.7822 6.3592 0.7558 82.8496 14.0163 89.0345 43.8787 5.3345 7.1394 13.0862 1.7917 12.6324 58.9606 149.0718 74.7275 85.4824 81.6943 3.4333 6.4499 25.5321 21.6466 15.1427 2.1598 20.1272 7.6304 1.3381 41.5597 122.9870 19.6653 190.1535 11.2967 15.7943 3.4233 3.8204 62.6550 59.6582 11.9330 41.0993 34.4248 13.8554 1.4086 7.5219 12.6621 8.2075 75.3477 0.1742 23.2099 11.1536 52.1050 35.3936 51.8444 18.1922 86.9125 20.4329 20.1955 26.6576 1.2740 8.5521 45.1552 20.1150 14.3074 6.8746 137.4363 47.3648 562.3026 32.3551 44.9929 39.4976 6.9990 2.5387 21.4371 10.7394 14.4417 49.0922 144.2274 15.5370 53.3187
temp: 298.150 k
press: 1.00000 atm
elementType: 8 8 8 7 7 7 7 7 7 6 6 6 6 6 6 6 6 6 1 1 1 1 1 1 1 1 1 1 1 1
symmnumber: 1
zpe: 597044.6 jmol-1
zpe.correction: 0.227402 hartree
zpe.thermalcorrener: 0.243145 hartree
zpe.thermalcorrenthalpy: 0.244089 hartree
zpe.thermalcorrgfe: 0.183139 hartree
zpe.sumelectzpe: -902.947432 hartree
zpe.sumelectthermal: -902.931690 hartree
zpe.sumelectthermalent: -902.930745 hartree
zpe.sumelectthermalfe: -902.991695 hartree
dipole: -1.0949 -1.2675 -1.4495
dipole: 2.2151
quadrupole: -92.2939 -102.2588 -106.2159
quadrupole: 8.9886 -6.5781 8.5120
quadrupole: 7.9623 -2.0026 -5.9598 8.9886 -6.5781 8.5120
hfenergy: -903.1748343 hartree
pointgroup: C01 [X(C9H12N6O3)]
dipole: 0.390422 -0.2491771 0.7382292 debye
polarizability: 210.8633913|7.8187974|137.3250043|16.9190229|-16.5419624|101.7919777 unknown
InChI: InChI=1S/C9H12N6O3/c10-8-7-9(12-3-11-8)15(14-13-7)6-1-4(17)5(2-16)18-6/h3-6,16-17H,1-2,10H2
charge 0 multiplicity 1
30 atoms
O  -1.823887 1.04225 0.244145
O  -3.959449 -1.300627 -1.638401
O  -5.280248 -0.28081 0.828494
N  0.268133 0.057703 -0.464047
N  0.244811 -1.287189 0.020458
N  1.477542 -1.583134 0.467956
N  1.994446 1.839286 -0.627698
N  4.164667 1.054332 0.242908
N  4.500146 -1.112731 1.113173
C  -3.222945 -0.09137 -1.302871
C  -0.957946 0.728661 -0.917625
C  -1.7986 -0.142649 -1.892166
C  -2.942129 0.068534 0.210935
C  -4.124164 0.634929 0.999309
C  1.530549 0.59596 -0.30091
C  2.288486 -0.455409 0.282301
C  3.666325 -0.186496 0.556089
C  3.318668 1.975761 -0.31911
H  -3.761433 0.815578 -1.65605
H  -0.629923 1.696268 -1.331728
H  -1.455496 -1.189945 -1.873812
H  -1.746127 0.2363 -2.924006
H  -2.612717 -0.908841 0.625202
H  -4.446509 1.599077 0.57443
H  -3.877731 0.776492 2.06851
H  -4.814813 -1.250137 -1.130643
H  -5.196566 -1.032137 1.467831
H  3.767724 2.94632 -0.549778
H  4.15379 -2.039108 1.354947
H  5.471792 -0.857966 1.282558
