program: Gaussian 09
title: 000287058
version: EM64L-G09RevD.01
frameworkgroup: C1[X(C24H27NO5)]
method: RPBEPBE
basis: SDD
operation: Freq
keyword: #p
keyword: freq=noraman
keyword: PBEPBE/SDD
title: #p freq=noraman PBEPBE/SDD
converged: YES YES NO NO
title: Mulliken charges:
elementType: O O O O O N C C C C C C C C C C C C C C C C C C C C C C C C H H H H H H H H H H H H H H H H H H H H H H H H H H H
charge: -0.230012 -0.230855 -0.314856 -0.245585 -0.237522 -0.351065 0.417539 0.415442 -0.648699 -0.547357 0.440033 -0.408584 -0.635705 0.563031 -0.381233 -0.445903 0.257813 -0.589769 -0.573408 0.195261 0.197260 -0.514446 -0.481906 0.183698 0.182085 -0.342756 -0.536692 -0.537266 -0.556717 -0.538464 0.248401 0.244034 0.225262 0.208067 0.223296 0.249111 0.245128 0.257177 0.238524 0.328035 0.254733 0.253289 0.279590 0.225961 0.237742 0.248587 0.221312 0.222610 0.248540 0.222432 0.220913 0.214864 0.265437 0.236693 0.245359 0.217385 0.214158
chargesum: 0.00000
title: Mulliken charges with hydrogens summed into heavy atoms:
elementType: O O O O O N C C C C C C C C C C C C C C C C C C C C C C C C
charge: -0.230012 -0.230855 -0.314856 -0.245585 -0.237522 -0.023030 0.417539 0.415442 -0.156264 -0.114027 0.440033 0.063823 -0.390577 0.563031 -0.124056 -0.207379 0.257813 -0.335036 -0.320120 0.195261 0.197260 -0.234857 -0.255945 0.183698 0.182085 -0.105014 0.155817 0.154619 0.160277 0.138437
polarizability: 3.91753446e+02 -2.01844434e+01 3.08346521e+02 -4.84111394e+01 9.09088141e+00 2.11107527e+02
1716.lowfreq: -8.2879 -1.8695 0.0003 0.0005 0.0008 3.1326 7.8266 14.4173 17.4943
frequency: 5.3243 14.2063 17.3794 29.4784 35.0057 61.9526 80.7652 84.0429 85.7025 100.4805 108.2601 122.4835 131.3089 149.4775 152.6063 167.2443 176.7285 181.7064 199.4283 203.2637 222.1505 240.4939 244.4240 251.1383 258.5398 270.6182 285.2360 313.8669 319.8285 336.7258 353.4531 363.2224 367.4207 379.3790 381.1884 426.4420 449.5646 449.8607 458.7947 475.8965 481.3063 497.3488 526.9341 568.9533 569.9433 587.4974 599.2982 602.2349 612.4620 626.9167 640.3282 674.9840 679.2241 726.3573 730.9231 733.6841 734.6832 769.5238 786.6555 788.9186 818.5444 834.4157 845.0074 848.1291 858.6666 878.4573 890.5050 901.0440 911.3326 917.0836 926.6768 963.3569 964.2402 969.7578 972.1751 986.6663 992.0196 999.8772 1056.6036 1091.9641 1111.4218 1112.7532 1113.1807 1113.7004 1120.2731 1132.6402 1143.7613 1157.5202 1158.6137 1161.0101 1169.2224 1178.4413 1179.5917 1185.2022 1198.2701 1204.1445 1222.0511 1235.5985 1246.2172 1248.4211 1261.6174 1277.4083 1281.9982 1288.1575 1292.3868 1319.5182 1335.8227 1357.6505 1398.4114 1411.1783 1411.6469 1420.1967 1433.1531 1434.2104 1435.9932 1443.3149 1447.2601 1448.8258 1457.2012 1465.7069 1466.0876 1467.1359 1470.5074 1471.0310 1472.2790 1472.4778 1474.4172 1479.2362 1490.5939 1502.4836 1512.2440 1518.6934 1580.5768 1591.6419 1601.1414 1609.6455 1613.3100 1636.4369 2950.9454 2956.2643 2958.5688 2959.2957 2962.4139 2994.4171 3001.3060 3010.5539 3035.6681 3046.5862 3047.0691 3054.6707 3055.6975 3070.2159 3110.1864 3116.3914 3121.0482 3122.6939 3125.2533 3128.6706 3129.2512 3140.2676 3148.8689 3151.5252 3157.9251 3164.8895 3516.0947
redmass: 5.7237 4.4230 4.8494 4.4565 5.1996 4.3499 4.1100 5.3710 3.5329 3.4467 3.6630 4.4259 4.2339 4.3657 3.9169 3.1009 3.4447 3.3906 2.2044 2.1391 2.6184 1.2252 1.1808 3.1277 1.6438 1.4934 2.7090 3.2688 3.3631 3.6150 3.9549 3.5987 4.6420 3.1827 4.3602 5.0196 4.1524 5.4760 3.2337 4.9713 2.9257 3.8375 4.5402 3.8369 3.5559 3.8750 3.7416 3.7840 2.8914 1.5184 6.5771 4.4959 4.6217 3.9338 5.8648 3.2129 5.1384 2.0649 2.9339 1.4681 1.6123 3.0305 1.5263 1.9778 2.4550 1.8028 2.4893 2.0358 1.9455 2.0100 2.1046 3.3913 6.6827 1.4484 3.3535 8.1131 4.6084 3.3422 2.1299 3.9433 1.2623 1.2634 1.2722 1.2626 2.6810 2.1145 1.5873 1.4054 1.3914 1.3830 1.7246 1.5372 1.2553 1.5589 1.3479 1.8411 1.8958 1.3226 1.8379 1.8903 3.5948 2.1375 2.2547 1.3620 1.9064 1.8310 1.6649 1.3772 4.6466 2.4489 2.4579 4.7152 1.3935 2.0837 1.1890 1.2249 1.2859 1.6389 1.1420 1.0511 1.0502 1.0498 1.0802 1.1234 1.0736 1.0726 1.0839 1.0783 2.8492 1.8478 2.5975 3.8100 7.5797 7.0120 7.0447 6.3631 6.1940 6.7395 1.0334 1.0616 1.0330 1.0331 1.0331 1.0657 1.0606 1.0984 1.1035 1.1038 1.1038 1.0999 1.1038 1.0972 1.0913 1.0869 1.0941 1.0932 1.1005 1.0992 1.0993 1.0976 1.0903 1.0905 1.0933 1.0908 1.0772
irintensity: 0.0619 0.0537 0.1607 0.0324 0.8439 0.6020 14.4978 15.4033 1.0353 6.8316 6.4859 1.5746 1.0546 0.1303 0.0395 1.5406 7.1367 8.2677 1.1626 1.3552 0.0718 0.6277 0.0583 2.4912 1.7947 0.0938 3.7971 0.9331 6.1026 4.9121 1.9857 6.3695 5.9233 1.1274 8.1205 3.1384 1.3997 1.7721 3.8358 26.8035 11.7422 2.5576 7.4173 16.2486 14.0905 3.3029 8.9531 9.6151 10.8504 52.7270 3.5621 6.1474 0.3123 0.3494 13.9657 1.3903 25.1808 0.9765 0.8309 66.7340 1.1450 21.0438 15.3678 7.9327 15.5391 44.6308 28.6176 14.1492 4.4765 5.8703 19.7611 11.3609 26.4575 4.5615 20.4655 39.2195 23.2488 27.3226 10.2496 0.9222 0.2756 0.0771 3.8843 0.2344 81.5678 113.9282 6.8417 3.5175 17.3787 6.5510 102.4321 27.0600 2.5397 15.3512 3.0378 115.4513 94.6034 46.9596 25.3554 44.4859 153.3298 160.3404 83.6457 13.6477 13.7139 6.2778 23.6672 5.1492 1.6335 17.3323 11.0555 12.0804 40.2381 2.4093 10.9291 33.8884 10.5359 6.1159 25.2901 13.7873 10.9109 17.9509 39.4579 132.5097 56.2131 25.5455 16.4706 62.0314 87.0343 153.9136 131.8064 135.4182 1.3615 24.5449 301.5553 39.7363 43.7868 24.1225 77.9887 29.9487 104.0834 21.7237 52.3475 79.3927 17.1565 22.9695 56.5649 14.5072 77.8700 4.2287 28.6150 15.4163 14.9400 5.0860 40.5619 1.2410 25.0587 17.1409 33.4396 14.6491 16.2594 5.1145 15.6666 3.1190 57.1993
temp: 298.150 k
press: 1.00000 atm
elementType: 8 8 8 8 8 7 6 6 6 6 6 6 6 6 6 6 6 6 6 6 6 6 6 6 6 6 6 6 6 6 1 1 1 1 1 1 1 1 1 1 1 1 1 1 1 1 1 1 1 1 1 1 1 1 1 1 1
symmnumber: 1
zpe: 1209425.5 jmol-1
zpe.correction: 0.460646 hartree
zpe.thermalcorrener: 0.490151 hartree
zpe.thermalcorrenthalpy: 0.491095 hartree
zpe.thermalcorrgfe: 0.396800 hartree
zpe.sumelectzpe: -1359.389921 hartree
zpe.sumelectthermal: -1359.360416 hartree
zpe.sumelectthermalent: -1359.359471 hartree
zpe.sumelectthermalfe: -1359.453766 hartree
dipole: -4.1232 2.0152 2.3235
dipole: 5.1440
quadrupole: -184.8332 -149.4224 -175.5682
quadrupole: 11.6855 5.0741 -0.2449
quadrupole: -14.8919 20.5189 -5.6270 11.6855 5.0741 -0.2449
hfenergy: -1359.8505664 hartree
pointgroup: C01 [X(C24H27N1O5)]
dipole: 1.572632 0.3171121 -1.2337028 debye
polarizability: 370.0059058|-2.916353|303.637264|-80.7271023|9.8643081|237.5643236 unknown
InChI: InChI=1S/C24H27NO5/c1-27-20-8-6-16(12-21(20)28-2)9-10-25-24(26)13-17-5-7-18-14-22(29-3)23(30-4)15-19(18)11-17/h5-8,11-12,14-15,25H,9-10,13H2,1-4H3
charge 0 multiplicity 1
57 atoms
O  6.166787 -2.470453 -1.411681
O  6.279898 0.145019 -1.609776
O  -3.221039 -2.387468 0.971304
O  -4.982091 1.328876 2.287867
O  -4.053948 3.805307 2.010467
N  -1.889947 -1.678969 -0.807377
C  0.436713 -1.471462 0.836769
C  2.72952 -1.630337 -0.084784
C  -0.819337 -2.120853 1.391057
C  -3.174987 -0.03496 -2.227155
C  2.792667 -0.191585 -0.194407
C  -2.993608 -1.504038 -1.762634
C  1.540547 -2.237217 0.433571
C  -3.38033 0.986577 -1.11133
C  0.510532 -0.040799 0.719673
C  1.657665 0.578687 0.218296
C  -2.081816 -2.068029 0.500967
C  3.863168 -2.40895 -0.49377
C  3.985025 0.418762 -0.707298
C  5.016839 -1.800051 -0.991461
C  5.079573 -0.353479 -1.100788
C  -4.10757 0.656005 0.062977
C  -2.867703 2.29449 -1.237141
C  -4.311487 1.598732 1.091918
C  -3.797791 2.928638 0.946399
C  -3.079681 3.260598 -0.222262
C  6.156923 -3.932142 -1.316382
C  6.395853 1.599524 -1.736221
C  -5.491032 -0.038888 2.474567
C  -3.544072 5.169785 1.881665
H  -1.118582 -1.64908 2.345418
H  -0.642463 -3.188755 1.619295
H  -4.044956 -0.025642 -2.917682
H  -2.300734 0.267259 -2.837696
H  -2.82252 -2.141922 -2.651974
H  -3.901235 -1.879202 -1.259458
H  1.501253 -3.33117 0.51972
H  -0.349152 0.565407 1.030046
H  1.698946 1.671923 0.140092
H  -0.948383 -1.387409 -1.083444
H  3.806405 -3.498375 -0.404906
H  4.020054 1.51023 -0.781221
H  -4.485617 -0.36125 0.194822
H  -2.296907 2.573325 -2.131078
H  -2.675171 4.269251 -0.350974
H  7.141344 -4.24844 -1.690045
H  5.357317 -4.369709 -1.945652
H  6.02784 -4.26452 -0.267782
H  7.400307 1.77015 -2.149508
H  6.305681 2.096457 -0.750477
H  5.6311 2.004428 -2.427662
H  -6.283127 -0.270527 1.735694
H  -4.683925 -0.791211 2.39393
H  -5.917499 -0.040943 3.488427
H  -3.855634 5.677984 2.806081
H  -3.983652 5.686034 1.005015
H  -2.438661 5.184988 1.801688
