program: Gaussian 09
title: 000286968
version: EM64L-G09RevD.01
frameworkgroup: C1[X(C10H12N2O)]
method: RPBEPBE
basis: SDD
operation: Freq
keyword: #p
keyword: freq=noraman
keyword: PBEPBE/SDD
title: #p freq=noraman PBEPBE/SDD
converged: NO YES NO NO
title: Mulliken charges:
elementType: O N N C C C C C C C C C C H H H H H H H H H H H H
charge: -0.240643 -0.436060 0.028552 0.471299 0.019163 -0.415716 -0.362241 -0.189683 -0.189989 0.147666 -0.259831 -0.793927 -0.745931 0.220198 0.272232 0.303200 0.227094 0.227607 0.227618 0.228143 0.301185 0.231093 0.241392 0.241697 0.245881
chargesum: 0.00000
title: Mulliken charges with hydrogens summed into heavy atoms:
elementType: O N N C C C C C C C C C C
charge: -0.240643 -0.132860 0.028552 0.471299 0.019163 -0.195518 -0.090009 0.037411 0.037618 0.147666 -0.028738 -0.036981 -0.016961
polarizability: 2.56201890e+02 3.55402110e+00 1.28023928e+02 -4.06246025e-02 3.92331651e-02 5.97648995e+01
1716.lowfreq: -17.3503 -9.4333 0.0001 0.0005 0.0009 8.1425 18.0467 46.3682 61.2383
frequency: -4.2061 46.3307 61.2372 74.9327 106.2039 178.1517 204.1412 214.5696 243.4539 282.4471 346.4761 407.0074 408.0854 446.1031 510.3075 541.1360 546.7101 593.5573 614.4164 620.6255 648.3101 695.4182 753.1152 763.3079 834.8987 861.9930 906.5798 937.7429 969.5909 981.7117 984.0359 992.2596 1010.4890 1020.0862 1041.2164 1082.2283 1112.6875 1165.2357 1170.9167 1178.4166 1259.5281 1309.5705 1340.7538 1369.9255 1378.8378 1386.9386 1432.1717 1441.2115 1448.2601 1455.2982 1483.5733 1486.8263 1512.1337 1543.1259 1579.2712 1603.7423 1614.7571 2956.1808 3000.2904 3028.2881 3088.7884 3103.8967 3114.2483 3129.2697 3134.2106 3145.7958 3166.4950 3183.3802 3413.0303
redmass: 1.0413 3.3315 5.9497 4.5373 3.9690 1.1561 3.4225 3.9762 3.7941 3.6848 4.6843 2.9013 3.3853 2.1920 2.9824 4.4411 6.2634 2.4055 6.4584 4.6941 1.6649 1.9220 3.7758 1.7157 1.2579 3.6605 1.4401 2.3293 1.3588 2.4943 3.5052 1.3122 1.5209 2.1069 1.6964 1.5641 2.5446 4.7078 1.0646 1.1104 2.9169 1.5026 2.3801 1.2912 1.3890 4.5163 1.8182 1.1040 1.0501 1.2990 2.2425 1.0462 2.2509 4.6281 6.9228 4.9324 6.1581 1.0390 1.0357 1.0977 1.0965 1.0949 1.0883 1.1018 1.0867 1.0931 1.0984 1.0961 1.0744
irintensity: 2.1368 0.0030 1.0841 1.2711 7.8693 1.8178 0.2966 12.1789 0.5795 1.5102 4.7037 0.0486 0.8974 22.9027 15.4226 11.0357 5.7966 3.3647 0.3801 4.8808 41.3771 54.4533 21.5942 81.9357 0.0859 3.3832 8.8300 39.9491 0.0073 15.4008 5.8059 1.1311 6.9693 3.5797 0.4120 13.2323 46.8984 160.2082 4.5447 6.2911 357.8791 21.7063 96.4318 69.4197 56.9136 10.6131 0.0093 44.0358 18.2570 49.8794 93.0273 19.8279 17.1050 450.4330 44.9684 3.7479 79.6755 21.4083 2.8758 21.8474 11.7413 1.8596 13.3026 20.4196 0.3881 27.0335 30.2900 3.9319 1.9630
temp: 298.150 k
press: 1.00000 atm
elementType: 8 7 7 6 6 6 6 6 6 6 6 6 6 1 1 1 1 1 1 1 1 1 1 1 1
symmnumber: 1
zpe: 524358.7 jmol-1
zpe.correction: 0.199718 hartree
zpe.thermalcorrener: 0.211783 hartree
zpe.thermalcorrenthalpy: 0.212727 hartree
zpe.thermalcorrgfe: 0.160735 hartree
zpe.sumelectzpe: -572.015902 hartree
zpe.sumelectthermal: -572.003837 hartree
zpe.sumelectthermalent: -572.002892 hartree
zpe.sumelectthermalfe: -572.054885 hartree
dipole: 3.9929 -1.5595 0.0023
dipole: 4.2866
quadrupole: -92.8007 -64.5724 -80.6335
quadrupole: -0.4655 -0.0635 0.0028
quadrupole: -13.4652 14.7632 -1.2980 -0.4655 -0.0635 0.0028
hfenergy: -572.2156197 hartree
pointgroup: C01 [X(C10H12N2O1)]
dipole: -1.6042417 0.4868002 -0.183367 debye
dipolederiv: -1.5348434 -0.0938179 -0.0237499 -0.1600922 -0.5676013 0.0541391 -0.0001115 0.0580134 -0.3399209 -1.7874888 -0.2816246 0.0123925 0.7276176 0.0128069 -0.0436959 -0.2433288 -0.083267 -0.2571913 1.6536852 -0.0480329 0.0777688 -0.6989324 -0.4000893 0.0558602 0.2421575 0.081319 -0.0836415 1.4039291 0.3657149 -0.0398873 0.6125415 0.1615336 0.0060298 -0.1020663 -0.003402 0.0862843 -1.52297 0.1253171 -0.0870479 0.4309402 0.2600772 -0.0702494 -0.1631413 -0.0814735 -0.065636 -0.4409713 -0.1215842 0.0218626 0.0609757 0.0473193 -0.0625051 -0.0241495 -0.0699987 -0.1951037 -0.1707121 -0.0316923 0.0084564 -0.3263918 -0.1350254 -0.0233057 0.0825022 -0.0116208 -0.1698816 0.2054227 0.0238929 0.0077663 -0.070906 0.1015753 -0.0617644 0.0317846 -0.0578423 -0.1166946 0.0383128 -0.0293967 0.0146109 0.1108336 0.1618534 -0.0698787 -0.020806 -0.0754611 -0.1158172 1.9957169 -0.044142 0.0836573 -0.7513231 0.808874 -0.2038881 0.2556654 -0.1769511 0.1612574 -0.1023202 0.062105 -0.0114367 -0.0250158 -0.1613803 -0.0089052 0.0101003 -0.0055868 -0.1922527 -0.0545655 0.0542791 -0.0199919 -0.0589193 -0.2162226 0.08662 0.0066233 0.0907531 0.1115668 0.0729034 -0.1134113 0.0293986 0.0851768 -0.4415784 0.1235189 -0.0200621 0.1147012 0.0092554 0.0845102 -0.0699388 0.0140665 -0.0418795 -0.095981 0.0647449 0.0070979 0.0637153 0.152787 0.0449927 0.0778314 -0.024544 0.0870436 0.0694097 0.0272506 -0.0267785 0.0269173 0.1563161 0.057707 0.0346606 -0.0182599 -0.0094284 0.0438501 0.0638747 -0.0072773 0.0661861 0.281686 -0.0680835 0.0899434 -0.031766 0.1148987 0.019655 0.0390492 -0.0382047 0.0380464 0.1452872 0.0697996 -0.0213252 0.0019835 -0.0596544 -0.1018607 0.0614878 0.011564 0.0629697 0.1370917 0.0818745 0.0488329 -0.1208495 -0.0351615 0.0294387 0.0219618 -0.0276212 0.0666518 -0.0767669 0.0723104 0.1074945 0.0892544 -0.0139959 -0.0304623 -0.0467795 0.0488626 -0.0835752 -0.0073799 -0.0036804 -0.1224493 0.0266089 0.0309001 0.1898122 -0.0145348 -0.0120257 -0.0198957 0.1325408 -0.1075232 -0.0751314 0.007361 -0.0813348 0.0636144 0.0238545 0.0088741 0.024073 0.1662877 0.0449329 -0.0030932 0.1099717 0.0237623 0.0818553 -0.0163915 0.0821873 0.0163299 -0.022909 0.0553837 -0.0503561 -0.0926107 -0.0159127 0.0586563 -0.0279808 -0.0802158 -0.0630586 -0.009591 -0.0883224 0.115924 -0.0350155 0.0642577 0.0398699 0.0214879 -0.0216305 0.0224567 0.1124261 unknown
polarizability: 255.015883|12.7652777|125.0357713|4.4118749|-15.9148326|63.9390632 unknown
InChI: InChI=1S/C10H12N2O/c1-8(9(2)13)11-12-10-6-4-3-5-7-10/h3-7,12H,1-2H3
charge 0 multiplicity 1
25 atoms
O  4.645934 0.382269 0.307139
N  -0.014001 0.92942 -0.00115
N  1.098296 0.183331 0.229653
C  -1.30794 0.361172 0.08942
C  2.292197 0.767168 0.127312
C  -2.431156 1.191088 -0.165047
C  -1.492165 -1.005136 0.42518
C  -3.732603 0.653671 -0.083697
C  -2.799414 -1.526246 0.502143
C  3.473325 -0.103448 0.391949
C  -3.926326 -0.707075 0.24994
C  2.519988 2.219897 -0.23295
C  3.243212 -1.567603 0.745365
H  -2.28783 2.248036 -0.424745
H  -0.615408 -1.628132 0.617813
H  0.060721 1.925527 -0.249832
H  -4.594968 1.299676 -0.28163
H  -2.939701 -2.581639 0.761297
H  2.115225 2.467593 -1.235373
H  2.057382 2.907841 0.503705
H  3.60506 2.406934 -0.24408
H  -4.937627 -1.121904 0.312217
H  2.635079 -1.656076 1.662795
H  2.683502 -2.079389 -0.057127
H  4.218621 -2.055675 0.893402
