program: Gaussian 09
title: 000286990
version: EM64L-G09RevD.01
frameworkgroup: C1[X(C14H20O2)]
method: RPBEPBE
basis: SDD
operation: Freq
keyword: #pfreq=noraman
keyword: PBEPBE/SDD
title: #p freq=noraman PBEPBE/SDD
converged: YES YES NO NO
title: Mulliken charges:
elementType: O O C C C C C C C C C C C C C C H H H H H H H H H H H H H H H H H H H H
charge: -0.186223 -0.198845 -0.230264 -0.194906 -0.438728 -0.450123 -0.416189 -0.385430 -0.006328 0.123263 0.394723 -0.469676 -0.545031 -0.363708 -0.346166 -0.696463 0.254463 0.253481 0.205885 0.232806 0.210565 0.233414 0.204145 0.229162 0.208154 0.194838 0.264420 0.212351 0.230048 0.235370 0.199263 0.194239 0.202875 0.218745 0.210607 0.215265
chargesum: 0.00000
title: Mulliken charges with hydrogens summed into heavy atoms:
elementType: O O C C C C C C C C C C C C C C
charge: -0.186223 -0.198845 0.024198 0.058575 -0.000037 -0.006143 0.017117 0.017562 -0.006328 0.123263 0.394723 -0.205256 -0.102632 0.070924 0.050948 -0.051846
polarizability: 1.78597192e+02 1.14335328e+01 1.61498845e+02 6.73719976e+00 7.42819210e+00 1.20950216e+02
1716.lowfreq: -16.2410 -7.5113 -0.0009 -0.0006 -0.0005 8.8589 31.4193 39.1569 60.4224
frequency: 30.3473 39.0912 60.4083 80.4697 91.5084 118.7266 140.9656 164.7199 220.2865 224.3028 233.0721 265.0860 293.2424 307.6801 315.2270 350.7450 399.5750 421.1564 449.0358 461.2731 500.4897 562.1153 587.8619 643.6075 680.7259 726.7563 739.4529 774.4222 783.6651 801.5586 832.5540 864.1496 887.0662 896.2191 899.8978 911.1384 929.2904 940.2086 980.1031 1002.0954 1023.7900 1055.3880 1060.6961 1064.3775 1087.3964 1101.8305 1106.4255 1111.8439 1144.5283 1185.3354 1196.3493 1208.7693 1218.6112 1224.8111 1255.8641 1267.4213 1271.5990 1273.6335 1281.1889 1288.9966 1293.4078 1314.0691 1325.2163 1327.7278 1336.2448 1342.8438 1345.1573 1350.7133 1363.3757 1389.5810 1453.3325 1457.4807 1465.7904 1467.6153 1467.7618 1476.0294 1477.1527 1477.4424 1486.8572 1571.2799 1578.8013 1613.7225 2937.2553 2967.4384 2970.5708 2974.4412 2975.0601 2979.1715 2985.8955 2988.7353 2993.3831 3010.9313 3013.7699 3034.3131 3041.8856 3046.0031 3053.0194 3060.6846 3064.5829 3073.1163 3075.2647 3119.7763
redmass: 4.2254 3.7977 1.6903 4.2676 4.1598 2.5448 3.2595 3.4487 2.3616 1.4767 2.5007 2.7281 2.8365 3.0733 4.0413 2.2602 3.9090 5.0325 2.9087 5.9593 3.0436 2.9196 3.5586 4.1838 4.3992 1.9080 1.3857 2.9591 1.6665 1.4261 2.6579 2.2239 1.9382 2.2859 2.3039 1.5941 1.4850 1.5691 2.6575 3.1417 2.6510 2.0608 1.6207 2.6527 1.5989 1.8099 1.7215 1.3493 2.4277 1.4609 1.8280 1.5144 1.5421 1.4539 1.3355 1.4163 1.4955 1.9323 1.4664 1.0746 1.2738 1.3540 1.4674 1.4011 1.3710 1.5401 1.5248 1.4685 2.0254 1.2113 1.0919 1.1143 1.0849 1.0830 1.0700 1.0684 1.0455 1.0899 1.0798 10.5950 9.8413 7.6165 1.0798 1.0582 1.0634 1.0379 1.0619 1.0610 1.0656 1.0622 1.0594 1.0838 1.0976 1.0970 1.1006 1.0998 1.1005 1.1006 1.1037 1.1004 1.1010 1.0920
irintensity: 1.8116 0.1265 0.4269 4.9888 0.5010 1.1759 1.4772 0.7852 0.2026 0.2331 0.4550 1.7928 0.0688 4.1441 0.2564 4.0234 1.4540 15.9242 1.6657 0.6906 3.0774 5.4243 0.4745 1.7477 0.3163 1.5267 8.4491 0.2680 0.4052 0.1621 8.1549 6.6846 1.7734 13.3551 9.7230 10.3427 2.4644 8.6974 1.2703 2.1721 37.3456 1.0455 4.2587 7.1337 20.6766 20.4901 6.3283 4.9429 4.6551 11.6979 16.0418 5.0321 23.5576 10.7356 12.4179 2.0286 14.5778 75.1602 2.7215 3.6260 3.8226 6.1344 3.2866 1.3626 1.2060 1.1780 3.9902 0.1946 14.4412 12.0640 18.3993 3.0406 11.9445 9.8252 0.2591 6.1254 13.6164 10.2452 16.3906 18.3279 258.0952 69.3479 18.6807 25.2080 32.9198 31.5784 17.5008 26.8143 30.5063 24.1116 43.2781 17.3625 9.9275 46.5699 1.4665 39.8609 42.9237 37.1203 1.3548 63.2893 79.2557 10.4146
temp: 298.150 k
press: 1.00000 atm
elementType: 8 8 6 6 6 6 6 6 6 6 6 6 6 6 6 6 1 1 1 1 1 1 1 1 1 1 1 1 1 1 1 1 1 1 1 1
symmnumber: 1
zpe: 812181.0 jmol-1
zpe.correction: 0.309343 hartree
zpe.thermalcorrener: 0.325325 hartree
zpe.thermalcorrenthalpy: 0.326269 hartree
zpe.thermalcorrgfe: 0.265068 hartree
zpe.sumelectzpe: -694.703874 hartree
zpe.sumelectthermal: -694.687892 hartree
zpe.sumelectthermalent: -694.686948 hartree
zpe.sumelectthermalfe: -694.748149 hartree
dipole: -0.7659 -1.1986 -0.0274
dipole: 1.4227
quadrupole: -91.1483 -111.9891 -96.0565
quadrupole: -11.4059 -1.9007 -5.2212
quadrupole: 8.5830 -12.2578 3.6749 -11.4059 -1.9007 -5.2212
hfenergy: -695.0132173 hartree
pointgroup: C01 [X(C14H20O2)]
dipole: 0.2923256 -0.4765191 -0.0274791 debye
polarizability: 178.274637|-12.240557|162.8184348|5.1486426|-4.31519|119.9531816 unknown
InChI: InChI=1S/C14H20O2/c1-2-3-6-10-9-13(15)11-7-4-5-8-12(11)14(10)16/h9,11-12H,2-8H2,1H3
charge 0 multiplicity 1
36 atoms
O  0.467847 -1.695617 1.082355
O  -1.738426 3.147405 -0.184274
C  -1.590228 -0.35596 1.00022
C  -2.081269 0.731224 -0.002018
C  -2.381737 -1.67656 0.852378
C  -2.081896 0.191709 -1.468431
C  -2.395044 -2.189049 -0.607176
C  -2.914331 -1.105699 -1.580462
C  -0.070774 -0.560608 0.919805
C  -1.244334 2.006108 0.071275
C  0.786315 0.663633 0.7313
C  0.198683 1.857326 0.380681
C  2.279296 0.506931 0.911259
C  2.959369 -0.102116 -0.353039
C  4.482788 -0.278214 -0.163978
C  5.164286 -0.886141 -1.408844
H  -1.761661 0.043934 2.025566
H  -3.124431 1.004183 0.250253
H  -3.422484 -1.50138 1.191463
H  -1.938039 -2.44053 1.515812
H  -1.040493 -0.010148 -1.792719
H  -2.485713 0.977143 -2.133675
H  -3.02417 -3.096697 -0.67488
H  -1.369176 -2.489151 -0.89682
H  -2.88079 -1.477929 -2.622407
H  -3.976666 -0.879965 -1.353364
H  0.79913 2.772375 0.288902
H  2.738002 1.490008 1.129492
H  2.481961 -0.169102 1.763132
H  2.497949 -1.083754 -0.569287
H  2.765974 0.553714 -1.225877
H  4.941834 0.704118 0.07021
H  4.665969 -0.928734 0.714887
H  6.252028 -1.006814 -1.253569
H  5.019019 -0.242234 -2.296663
H  4.74341 -1.881813 -1.642909
