program: Gaussian 09
title: 000286994
version: EM64L-G09RevD.01
frameworkgroup: C1[X(C16H17NO)]
method: RPBEPBE
basis: SDD
operation: Freq
keyword: #p
keyword: freq=noraman
keyword: PBEPBE/SDD
title: #p freq=noraman PBEPBE/SDD
converged: YES YES NO NO
title: Mulliken charges:
elementType: O N C C C C C C C C C C C C C C C C H H H H H H H H H H H H H H H H H
charge: -0.246174 -0.125162 -0.467607 0.329521 -0.491647 -0.293578 0.124673 -0.585253 0.452448 0.457896 -0.356615 -0.347745 -0.371464 -0.446099 -0.816840 -0.228597 -0.219428 -0.244184 0.255162 0.205927 0.221529 0.199662 0.225685 0.195500 0.232103 0.246937 0.230496 0.273776 0.230628 0.222553 0.227429 0.228104 0.227242 0.225044 0.228076
chargesum: 0.00000
title: Mulliken charges with hydrogens summed into heavy atoms:
elementType: O N C C C C C C C C C C C C C C C C
charge: -0.246174 -0.125162 -0.006518 0.329521 -0.070455 0.127607 0.124673 -0.353150 0.452448 0.457896 -0.109678 -0.117249 -0.097688 -0.215471 -0.138754 -0.001355 0.005616 -0.016108
polarizability: 2.20927133e+02 -6.48806814e-01 1.70404113e+02 -2.28378183e+01 -6.82580622e-01 1.37803870e+02
1716.lowfreq: 0.0004 0.0006 0.0008 3.0098 7.7456 10.6711 16.9392 30.9771 33.0581
frequency: 15.5866 30.0480 32.9325 39.2573 98.4768 124.5958 170.3017 195.7711 200.6358 234.4420 286.6994 307.2885 323.1762 354.8332 405.9483 414.6025 423.6205 443.3978 459.8656 490.6872 542.2753 566.3675 593.6180 617.0903 666.0400 706.2848 716.4145 722.9743 743.2712 751.8451 802.4726 820.7094 860.9888 865.9306 879.8984 912.5770 921.3955 951.6503 954.6759 977.2223 984.6895 989.7731 993.1260 1001.0640 1006.7138 1025.2627 1046.2778 1053.7446 1080.1794 1109.6484 1136.5057 1151.7320 1170.6422 1180.1387 1184.3035 1195.3847 1205.3030 1210.5135 1249.2235 1256.8031 1281.1152 1294.2011 1307.9681 1341.2142 1357.1635 1379.9179 1382.8736 1396.0281 1399.0541 1421.6092 1442.7750 1458.9418 1464.7710 1470.2716 1477.1543 1482.5310 1484.3075 1493.9591 1593.1566 1596.3938 1615.0448 1630.6808 2829.1099 2853.4361 2866.3047 2972.5217 2988.2864 3028.4670 3049.1839 3079.1766 3090.1713 3106.5710 3111.1956 3124.3415 3124.4727 3136.4540 3147.6453 3162.3006 3162.6411
redmass: 1.0442 4.2386 4.3844 3.9990 3.4155 3.8135 4.2379 3.0332 3.1273 3.6930 3.6528 2.6354 2.5527 3.1537 2.8823 3.2661 4.5338 3.1548 3.5302 4.6658 3.5161 5.0204 5.1907 6.3459 5.1874 2.1921 3.7181 4.4029 2.2954 2.3423 4.1102 1.3973 1.3038 3.6121 1.3451 1.6639 2.1697 1.3459 6.8774 1.8405 1.3898 5.1587 1.7679 1.4553 1.4603 2.1800 1.5249 1.9414 1.5726 2.4957 2.1641 1.4999 1.0615 1.1393 1.4987 1.1806 1.9386 2.6173 1.4252 3.1775 1.5973 1.5540 1.4281 1.3556 1.7087 3.4550 3.5242 2.0027 1.2497 3.2087 2.0642 1.1230 1.1397 1.0460 1.1724 1.4538 1.5123 2.5193 6.9613 6.1574 6.1103 6.7709 1.0714 1.0698 1.0709 1.0372 1.0869 1.0862 1.0976 1.0985 1.0922 1.0912 1.0874 1.0861 1.0892 1.0911 1.0956 1.1013 1.0954
irintensity: 0.3199 0.1724 0.8350 0.0166 1.5330 1.6368 0.5006 2.1172 1.6800 2.6581 2.5480 0.2073 4.2477 14.6491 0.1421 3.8323 5.1877 2.4756 2.8809 11.9237 4.8095 5.8578 1.3744 0.2444 3.2335 39.8581 1.1112 2.0623 41.3873 22.7633 16.4202 50.7391 3.2037 33.7233 2.1393 10.0389 9.0149 1.4875 121.5394 9.2760 0.4233 0.0645 1.6821 4.5246 1.4636 16.4546 11.4401 8.8384 13.3975 32.4848 135.2939 2.3142 0.6773 0.5831 9.3834 5.3110 86.4898 40.4233 18.2029 14.5424 1.8311 15.2233 11.8884 6.9222 30.0498 12.2136 3.6486 1.0624 8.9891 14.6259 12.7991 11.2259 9.9249 11.1719 10.7466 19.9339 5.1175 109.1499 6.2054 0.7820 6.1881 3.5154 56.2181 44.6537 211.6263 49.1320 19.9219 12.5268 23.5466 18.4967 31.4954 18.6897 9.6366 0.4165 17.7904 16.5084 30.7137 28.5225 8.3926
temp: 298.150 k
press: 1.00000 atm
elementType: 8 7 6 6 6 6 6 6 6 6 6 6 6 6 6 6 6 6 1 1 1 1 1 1 1 1 1 1 1 1 1 1 1 1 1
symmnumber: 1
zpe: 756400.6 jmol-1
zpe.correction: 0.288098 hartree
zpe.thermalcorrener: 0.303896 hartree
zpe.thermalcorrenthalpy: 0.304840 hartree
zpe.thermalcorrgfe: 0.242135 hartree
zpe.sumelectzpe: -748.565798 hartree
zpe.sumelectthermal: -748.550000 hartree
zpe.sumelectthermalent: -748.549056 hartree
zpe.sumelectthermalfe: -748.611761 hartree
dipole: 1.0559 -0.5157 -1.9098
dipole: 2.2423
quadrupole: -99.6159 -101.2296 -104.1876
quadrupole: 3.4818 -3.2290 -3.7034
quadrupole: 2.0618 0.4481 -2.5099 3.4818 -3.2290 -3.7034
hfenergy: -748.8538962 hartree
pointgroup: C01 [X(C16H17N1O1)]
dipole: 0.3797335 0.3404538 0.719842 debye
polarizability: 218.1220175|4.5017681|168.6046676|26.9199338|-7.2926271|142.4084308 unknown
InChI: InChI=1S/C16H17NO/c1-13-7-8-16-15(9-13)11-17(12-18-16)10-14-5-3-2-4-6-14/h2-9H,10-12H2,1H3
charge 0 multiplicity 1
35 atoms
O  -1.542996 -2.268551 -0.315985
N  0.432692 -1.187705 0.555431
C  -0.252119 0.05398 0.971772
C  -1.635727 0.122569 0.335583
C  1.808632 -1.352855 1.054401
C  -0.441074 -2.345677 0.666928
C  -2.197216 -1.016333 -0.297362
C  -2.378982 1.327456 0.328717
C  2.790151 -0.357293 0.435177
C  -3.641865 1.432287 -0.298906
C  -3.450111 -0.936992 -0.94772
C  -4.160743 0.277495 -0.946879
C  2.662108 0.033133 -0.921267
C  3.870222 0.149156 1.198085
C  -4.422747 2.735996 -0.291718
C  3.60292 0.910026 -1.504681
C  4.816726 1.022985 0.61463
C  4.685905 1.405603 -0.740066
H  0.354133 0.91643 0.640668
H  -0.332867 0.124297 2.088408
H  2.130092 -2.38253 0.795989
H  1.869706 -1.270705 2.168778
H  0.10945 -3.267789 0.425056
H  -0.922275 -2.438372 1.673418
H  -1.948317 2.213147 0.815162
H  -3.846329 -1.832445 -1.436601
H  -5.133277 0.331828 -1.451342
H  1.812951 -0.351214 -1.497867
H  3.971811 -0.139177 2.252414
H  -3.855469 3.544569 0.201196
H  -4.660662 3.071264 -1.318877
H  -5.384838 2.628164 0.244868
H  3.493114 1.206755 -2.554086
H  5.648483 1.407788 1.21575
H  5.41612 2.085409 -1.193576
