program: Gaussian 09
title: 000286980
version: EM64L-G09RevD.01
frameworkgroup: C1[X(C14H26O)]
method: RPBEPBE
basis: SDD
operation: Freq
keyword: #pfreq=noraman
keyword: PBEPBE/SDD
title: #p freq=noraman PBEPBE/SDD
converged: YES YES NO NO
title: Mulliken charges:
elementType: O C C C C C C C C C C C C C C H H H H H H H H H H H H H H H H H H H H H H H H H H
charge: -0.479525 0.363971 -0.136470 -0.166555 -0.416547 -0.460042 -0.435950 -0.447106 -0.431747 -0.432941 -0.547776 -0.374848 -0.350428 -0.359774 -0.697785 0.182781 0.229618 0.185773 0.205005 0.203110 0.197934 0.229327 0.184815 0.198632 0.202614 0.202432 0.199740 0.203174 0.210879 0.191122 0.219304 0.219822 0.194025 0.317306 0.183881 0.184642 0.197942 0.195451 0.209235 0.215776 0.209183
chargesum: 0.00000
title: Mulliken charges with hydrogens summed into heavy atoms:
elementType: O C C C C C C C C C C C C C C
charge: -0.162219 0.363971 0.046311 0.063063 -0.025769 -0.058997 -0.021807 -0.045860 -0.029575 -0.018888 -0.137350 0.038999 0.018095 0.033618 -0.063591
polarizability: 1.71138768e+02 -1.04670573e+00 1.36444856e+02 5.73864800e-01 3.02429147e-01 1.34912597e+02
1716.lowfreq: -5.6501 -0.0006 -0.0006 -0.0004 6.2726 18.4876 37.5071 53.5379 69.5430
frequency: 37.1008 53.4100 69.5315 102.7974 131.3924 146.3625 153.9884 185.0050 213.9185 226.6173 261.1268 275.5950 291.3653 302.8487 330.9573 364.6512 390.4753 395.0903 433.5782 444.2816 460.0692 519.9791 561.0268 617.6711 666.3960 726.0098 728.7277 749.7705 780.1227 792.5733 821.4267 828.1195 835.8072 867.2060 890.9920 900.5200 905.9148 943.7772 946.4989 981.1017 989.6463 1005.9196 1024.7771 1048.8160 1054.2684 1077.2796 1086.4905 1091.8534 1101.0645 1104.7178 1114.0974 1127.5115 1132.4598 1137.8762 1162.3889 1195.4134 1204.2453 1223.1152 1237.1760 1248.0441 1259.5754 1262.2056 1284.2528 1287.2688 1290.7597 1298.2969 1303.8139 1311.5158 1321.5111 1333.4848 1342.2763 1348.3849 1350.1136 1352.3826 1354.3364 1357.5165 1362.9256 1387.9608 1389.6945 1452.6974 1455.1395 1461.7272 1464.3039 1470.1517 1470.7651 1476.2914 1477.1861 1481.3508 1483.2051 1489.4913 1503.4189 2927.8199 2935.5837 2948.1380 2965.4000 2967.2071 2970.3591 2972.7543 2973.3047 2976.6254 2979.9793 2988.5472 2994.3920 2995.0352 3005.4772 3012.6117 3016.7456 3021.0584 3022.7735 3025.0986 3042.6134 3046.1960 3055.7454 3066.4211 3067.3772 3069.6036 3536.0266
redmass: 3.4329 1.6814 2.7826 2.7890 1.8941 2.5464 2.6624 2.7199 3.8463 1.1353 2.0768 2.1852 1.3161 2.8854 2.3685 3.1979 1.8292 2.6486 3.5270 3.0138 3.2166 2.1600 2.8126 4.4762 2.9244 1.1223 1.5792 1.2208 2.3394 3.1242 2.8138 1.3574 1.4155 1.9991 1.7554 1.7009 2.1025 1.8398 2.1388 1.6030 1.6967 3.0835 2.3846 2.9782 1.9390 2.2780 2.1022 1.9653 1.5076 1.3957 2.0250 1.7521 1.9168 1.0574 1.3506 1.9739 1.6395 1.3884 1.3009 1.3196 1.3111 1.2609 1.2421 1.1068 1.5781 1.3877 1.4523 1.3094 1.4699 1.3581 1.3936 1.5040 1.3735 1.5229 1.4114 1.4583 1.4283 1.6738 1.2176 1.0844 1.0805 1.0765 1.0688 1.0728 1.0864 1.0425 1.0795 1.0791 1.0774 1.0923 1.0826 1.0793 1.0699 1.0588 1.0599 1.0611 1.0369 1.0615 1.0614 1.0621 1.0640 1.0968 1.0670 1.0673 1.0798 1.0949 1.0997 1.1013 1.0990 1.0968 1.0993 1.1012 1.0990 1.1007 1.0969 1.0992 1.0656
irintensity: 0.0327 0.0126 0.2037 0.1131 0.0282 0.4800 0.6011 0.4288 0.4151 0.0226 9.2666 11.7778 124.2129 2.6099 0.0759 8.6153 3.2972 2.4357 5.2234 1.1904 4.7839 0.6792 8.7433 0.7494 0.6251 7.7312 1.5614 1.6689 0.4432 2.6531 0.4474 0.5146 0.1301 30.1219 14.0301 6.1734 11.4499 7.0619 4.4828 11.0768 18.5062 2.0348 0.7749 1.1540 5.9486 0.8594 0.7992 3.7487 9.6642 17.0848 12.0746 4.4310 15.0131 0.1694 9.3672 0.4054 1.0075 5.9561 6.7220 6.4617 5.4128 1.8736 1.9419 1.5835 0.7929 1.1580 1.8584 4.9469 7.4988 0.2221 0.3208 0.3650 0.6184 0.8093 0.4163 1.9432 1.7152 5.7576 11.7438 1.1562 10.6903 5.7166 0.0734 4.0943 10.1597 12.4804 8.4020 6.2286 4.9031 18.2138 16.9958 13.4902 44.8543 18.6251 14.4838 27.9669 49.3114 55.2277 1.9934 16.4871 120.9134 4.9251 125.5403 101.5220 23.5138 40.4253 9.9817 17.7922 15.7969 13.8247 10.8152 55.1432 85.7713 108.0093 72.5153 52.4590 2.5332
temp: 298.150 k
press: 1.00000 atm
elementType: 8 6 6 6 6 6 6 6 6 6 6 6 6 6 6 1 1 1 1 1 1 1 1 1 1 1 1 1 1 1 1 1 1 1 1 1 1 1 1 1 1
symmnumber: 1
zpe: 981941.9 jmol-1
zpe.correction: 0.374002 hartree
zpe.thermalcorrener: 0.390030 hartree
zpe.thermalcorrenthalpy: 0.390974 hartree
zpe.thermalcorrgfe: 0.331153 hartree
zpe.sumelectzpe: -623.080645 hartree
zpe.sumelectthermal: -623.064617 hartree
zpe.sumelectthermalent: -623.063673 hartree
zpe.sumelectthermalfe: -623.123493 hartree
dipole: -0.2699 0.9889 -1.1398
dipole: 1.5329
quadrupole: -96.3436 -96.7830 -93.0276
quadrupole: 1.6850 -0.0778 3.3894
quadrupole: -0.9589 -1.3983 2.3572 1.6850 -0.0778 3.3894
hfenergy: -623.4546465 hartree
pointgroup: C01 [X(C14H26O1)]
dipole: 0.1017846 -0.3963884 -0.4429961 debye
polarizability: 171.1248544|-0.9957891|136.4303861|-0.9743947|-0.3177235|134.9409811 unknown
InChI: InChI=1S/C14H26O/c1-2-3-4-11-14(15)12-7-5-8-13(14)10-6-9-12/h12-13,15H,2-11H2,1H3
charge 0 multiplicity 1
41 atoms
O  -0.397967 1.94538 -0.334096
C  -0.518349 0.456627 -0.302224
C  -1.67239 0.000033 -1.250423
C  -0.939697 0.111086 1.150558
C  -2.962402 0.811317 -0.939644
C  -1.865547 -1.545452 -1.168251
C  -2.22266 0.905425 1.534695
C  -1.069062 -1.431851 1.301322
C  -3.409129 0.744324 0.545452
C  -2.030071 -2.096275 0.27673
C  0.856702 -0.126503 -0.732665
C  2.044869 0.267322 0.173392
C  3.409939 -0.145361 -0.421775
C  4.605455 0.222347 0.48672
C  5.967576 -0.20286 -0.103182
H  -1.37397 0.235756 -2.297332
H  -0.136588 0.452342 1.832908
H  -3.782489 0.459659 -1.597632
H  -2.769134 1.869237 -1.199404
H  -0.998291 -2.039267 -1.649046
H  -2.749686 -1.827301 -1.774155
H  -1.943391 1.973754 1.579097
H  -2.541134 0.607327 2.554101
H  -1.408892 -1.665768 2.329671
H  -0.06121 -1.882942 1.200242
H  -3.940413 -0.205335 0.735968
H  -4.148904 1.546955 0.735775
H  -1.857929 -3.190832 0.27009
H  -3.072975 -1.95637 0.608665
H  1.05873 0.229723 -1.76835
H  0.805189 -1.22909 -0.800535
H  2.023676 1.361283 0.34507
H  1.930962 -0.209426 1.168345
H  -0.117515 2.204224 -1.250024
H  3.418359 -1.240047 -0.610349
H  3.543056 0.339553 -1.41233
H  4.602287 1.317027 0.664737
H  4.466667 -0.252802 1.479462
H  6.007234 -1.297709 -0.259276
H  6.803786 0.073576 0.565283
H  6.14421 0.280817 -1.082792
