program: Gaussian 09
title: 000286976
version: EM64L-G09RevD.01
frameworkgroup: C1[X(C13H21Cl)]
method: RPBEPBE
basis: SDD
operation: Freq
keyword: #p
keyword: freq=noraman
keyword: PBEPBE/SDD
title: #p freq=noraman PBEPBE/SDD
converged: NO YES NO NO
title: Mulliken charges:
elementType: Cl C C C C C C C C C C C C C H H H H H H H H H H H H H H H H H H H H H
charge: -0.132344 -0.116191 -0.043407 -0.043399 0.010440 -0.467319 -0.467321 -0.469997 -0.470000 -0.461481 -0.461481 -0.409266 -0.404035 -0.404034 0.190431 0.242757 0.242752 0.188237 0.200800 0.200800 0.188238 0.205454 0.187476 0.205454 0.187477 0.232903 0.195159 0.232903 0.195158 0.203029 0.192619 0.192889 0.231206 0.231204 0.192889
chargesum: 0.00000
title: Mulliken charges with hydrogens summed into heavy atoms:
elementType: Cl C C C C C C C C C C C C C
charge: -0.132344 0.074239 0.199350 0.199354 0.010440 -0.078282 -0.078283 -0.077067 -0.077070 -0.033419 -0.033420 -0.013618 0.020060 0.020058
polarizability: 1.44872102e+02 1.76648971e-04 1.44943354e+02 9.28596210e-01 -3.22767109e-04 1.23962736e+02
1716.lowfreq: -25.1549 -14.8494 -0.0013 0.0012 0.0020 14.0920 101.1011 110.3200 160.0523
frequency: 101.0836 110.3172 160.0516 161.0126 220.7195 234.7978 282.8125 295.0604 312.8051 345.2504 347.6493 366.7901 384.8916 385.6180 455.8111 463.1855 483.7662 493.5650 521.6279 538.1021 562.9555 791.9145 820.8851 823.5954 826.6217 829.4175 855.4396 866.5667 873.8592 879.5581 935.8531 971.3781 979.0123 984.5399 996.3456 1023.3259 1046.4698 1051.4762 1077.2362 1077.3105 1105.9796 1110.9316 1124.7468 1132.8529 1140.8784 1155.6654 1161.9334 1176.3388 1191.3629 1229.2650 1231.4110 1234.3820 1252.6622 1274.6570 1278.6274 1286.4939 1291.9152 1298.6735 1323.8274 1328.9132 1330.8115 1337.0281 1340.0269 1341.4257 1343.8453 1345.7334 1347.2254 1350.5245 1352.6992 1436.3267 1448.4166 1456.0966 1459.9078 1464.3340 1464.9421 1467.3836 1468.5006 1471.3142 2883.5883 2946.8984 2947.4450 2947.8445 2948.7094 2950.3501 2956.7686 2967.8533 2968.4347 2973.8978 2988.9570 2989.7158 3012.3153 3015.1460 3021.5663 3023.5602 3034.8185 3038.0291 3043.2329 3051.6787 3053.7264
redmass: 3.4412 3.0466 2.6841 5.0334 2.5809 3.0257 1.9748 1.9207 2.0937 3.2629 3.0269 3.0677 3.9050 3.1097 2.2175 3.5200 3.7198 2.6642 2.3093 1.8788 2.0101 2.3679 1.9262 2.2941 1.7140 1.4195 1.7179 2.5920 2.2618 1.6392 2.4946 2.3084 1.8646 1.9278 1.7309 1.7524 1.9159 1.8628 1.5840 1.2970 1.7035 1.7286 2.7632 1.4840 2.6052 2.8234 1.7675 1.4502 1.6936 1.3205 1.3832 1.2945 1.5314 1.3065 1.3022 1.2440 1.1965 1.4853 1.4368 1.4460 1.3693 1.5132 1.5375 1.4555 1.5034 1.4074 1.5418 1.5550 1.5427 1.0863 1.0860 1.0901 1.0876 1.0832 1.0852 1.0897 1.0914 1.0907 1.0779 1.0633 1.0631 1.0659 1.0655 1.0650 1.0652 1.0771 1.0633 1.0789 1.0631 1.0633 1.0981 1.0955 1.0980 1.0957 1.1030 1.0942 1.0947 1.1025 1.1016
irintensity: 1.0148 0.2876 0.6808 1.3285 0.3977 1.5521 0.7306 0.0464 0.1858 0.0038 5.0098 0.3654 2.2286 0.0325 0.0000 0.1690 3.4794 14.5559 7.7366 1.9088 0.0000 0.5845 10.9076 13.2065 15.7079 0.5184 2.2928 2.8030 7.6779 2.4503 3.0869 0.2813 12.9992 0.2827 0.2636 8.3368 2.4129 12.7922 0.3080 0.3920 0.6360 0.7186 2.3621 0.0911 5.6177 5.0031 1.7247 0.5215 3.6055 3.0467 0.2313 0.9793 5.3851 11.3847 0.8774 6.6661 1.8443 0.3518 0.0744 0.6487 2.1671 1.3458 0.9735 0.1896 0.1340 1.0995 0.4756 2.8866 0.0229 0.1418 15.7339 1.9751 0.8997 20.7815 3.6657 9.0360 18.4837 9.6429 11.3438 2.9669 8.8611 42.0906 0.0155 54.5453 52.1836 25.4575 34.8869 47.2429 56.7221 21.3144 0.1589 15.8381 131.8170 82.6322 77.4277 7.5167 61.6704 2.9468 85.0142
temp: 298.150 k
press: 1.00000 atm
elementType: 17 6 6 6 6 6 6 6 6 6 6 6 6 6 1 1 1 1 1 1 1 1 1 1 1 1 1 1 1 1 1 1 1 1 1
symmnumber: 1
zpe: 821004.7 jmol-1
zpe.correction: 0.312704 hartree
zpe.thermalcorrener: 0.325258 hartree
zpe.thermalcorrenthalpy: 0.326202 hartree
zpe.thermalcorrgfe: 0.275225 hartree
zpe.sumelectzpe: -966.964664 hartree
zpe.sumelectthermal: -966.952111 hartree
zpe.sumelectthermalent: -966.951167 hartree
zpe.sumelectthermalfe: -967.002143 hartree
dipole: 0.7950 0.0000 -2.2240
dipole: 2.3618
quadrupole: -94.7632 -92.0712 -94.7352
quadrupole: 0.0000 4.3693 -0.0002
quadrupole: -0.9067 1.7853 -0.8787 0.0000 4.3693 -0.0002
hfenergy: -967.2773686 hartree
pointgroup: C01 [X(C13H21Cl1)]
dipole: 0.2353725 0.0000014 -0.8989121 debye
polarizability: 144.8745805|0.000158|144.9433537|-0.9002569|-0.0001617|123.9602579 unknown
InChI: InChI=1S/C13H21Cl/c14-13-8-2-6-10-4-1-5-11(12(10)13)7-3-9-13/h10-12H,1-9H2
charge 0 multiplicity 1
35 atoms
Cl -1.664457 0.000167 1.892442
C  0.154767 -0.000017 -0.308543
C  0.847442 -1.295306 0.196634
C  0.847815 1.295074 0.196636
C  -1.374009 0.000191 -0.056831
C  2.356844 -1.27238 -0.146254
C  2.357209 1.27173 -0.14626
C  0.154121 -2.550585 -0.387599
C  0.154843 2.550554 -0.387576
C  -2.052856 -1.284006 -0.569291
C  -2.052501 1.284598 -0.569245
C  3.054415 -0.000423 0.386226
C  -1.361544 -2.577348 -0.0858
C  -1.360809 2.577738 -0.085751
H  0.241943 -0.000031 -1.424343
H  0.740721 -1.317496 1.302049
H  0.741111 1.317288 1.302052
H  2.477796 -1.320794 -1.250018
H  2.841902 -2.179262 0.266829
H  2.842519 2.178477 0.266822
H  2.478174 1.320106 -1.250025
H  0.636444 -3.462226 0.017323
H  0.313936 -2.568311 -1.487654
H  0.637429 3.462054 0.01735
H  0.314643 2.56825 -1.487633
H  -3.119913 -1.274258 -0.280502
H  -2.01517 -1.241733 -1.68012
H  -3.119556 1.275153 -0.28044
H  -2.014846 1.242338 -1.680074
H  3.021243 -0.000414 1.495115
H  4.123268 -0.000578 0.096428
H  -1.834739 -3.451021 -0.574112
H  -1.522247 -2.684119 1.00343
H  -1.521469 2.684539 1.003481
H  -1.833768 3.451551 -0.574044
