program: Gaussian 09
title: 000286975
version: EM64L-G09RevD.01
frameworkgroup: C1[X(C13H21Cl)]
method: RPBEPBE
basis: SDD
operation: Freq
keyword: #p
keyword: freq=noraman
keyword: PBEPBE/SDD
title: #p freq=noraman PBEPBE/SDD
converged: YES YES NO NO
title: Mulliken charges:
elementType: Cl C C C C C C C C C C C C C H H H H H H H H H H H H H H H H H H H H H
charge: -0.152454 -0.033762 -0.051865 -0.051576 -0.051787 -0.445875 -0.445695 -0.445811 -0.445607 -0.445736 -0.446139 -0.420106 -0.420271 -0.420013 0.198969 0.198908 0.199112 0.223247 0.192252 0.192238 0.223423 0.192200 0.223338 0.223254 0.192213 0.223256 0.192226 0.192207 0.223382 0.191286 0.204184 0.204201 0.191417 0.191224 0.204161
chargesum: 0.00000
title: Mulliken charges with hydrogens summed into heavy atoms:
elementType: Cl C C C C C C C C C C C C C
charge: -0.152454 -0.033762 0.147103 0.147332 0.147326 -0.030377 -0.030034 -0.030273 -0.030140 -0.030254 -0.030550 -0.024636 -0.024653 -0.024628
polarizability: 1.45189650e+02 -1.52370614e-02 1.45121882e+02 -1.17721800e-02 -7.50430395e-04 1.23090133e+02
1716.lowfreq: -2.7975 -0.0006 -0.0005 0.0014 13.0893 28.2289 120.4280 126.2912 179.0366
frequency: 120.4013 126.2822 179.0336 188.1809 193.5283 199.2386 282.8326 299.9011 300.5795 349.0287 352.8824 377.5359 379.2038 403.4130 450.5330 467.8672 517.8810 523.9942 525.7531 540.8333 541.8400 778.3104 823.5614 824.9669 825.3163 826.9616 858.1061 859.4103 884.0921 885.1891 928.7506 978.6932 983.1953 983.9486 1007.0261 1008.1643 1041.0225 1042.1920 1083.4039 1107.4173 1109.3247 1114.5186 1129.4705 1133.4715 1133.8773 1154.1914 1155.9507 1164.2580 1168.2336 1222.2157 1223.0309 1252.2509 1253.7126 1260.3611 1277.7224 1278.4896 1284.0445 1319.8797 1322.1214 1328.6850 1337.6328 1338.4105 1339.7188 1340.8319 1343.0182 1344.3084 1346.6797 1348.4314 1351.2235 1451.2826 1455.9103 1457.2111 1464.5770 1464.8611 1465.7426 1468.9449 1469.3184 1475.1963 2899.9641 2900.7336 2916.5234 2959.3530 2959.5368 2960.2888 2977.6851 2979.4831 2980.2194 2982.1576 2983.1362 2984.4586 3025.2495 3025.4643 3027.1308 3035.4338 3039.6002 3039.9217 3046.6239 3047.2002 3051.6678
redmass: 2.9405 3.0618 3.2822 3.1378 4.0993 3.1162 2.3679 1.8321 1.8468 3.4514 3.4727 3.2556 3.2922 3.2596 3.6771 3.9758 2.2821 2.5118 2.4655 1.7524 1.7474 2.5694 1.8263 2.1869 2.0288 1.3762 2.1965 2.2724 1.7263 1.6897 2.5423 2.4796 1.7014 1.6775 1.8071 1.8252 2.0558 2.0611 1.2091 1.6773 1.7008 1.6362 2.2337 2.2529 2.5243 1.6216 1.6026 3.7584 1.2645 1.4380 1.4398 1.3350 1.3282 1.2730 1.2236 1.2237 1.2184 1.6007 1.6169 1.4378 1.4205 1.4324 1.4861 1.4604 1.4699 1.4943 1.2893 1.5837 1.6226 1.0877 1.0857 1.0847 1.0846 1.0847 1.0837 1.0914 1.0909 1.0850 1.0801 1.0801 1.0804 1.0633 1.0633 1.0635 1.0607 1.0615 1.0614 1.0611 1.0605 1.0631 1.0962 1.0962 1.0953 1.1023 1.1019 1.1020 1.1021 1.1021 1.1013
irintensity: 0.0791 0.1240 0.6085 0.9807 1.4092 0.9076 2.6030 0.3562 0.3213 0.4520 0.4318 0.1794 0.1896 9.4828 0.0004 3.6029 14.2553 0.2474 0.0235 1.0019 1.0130 40.8915 2.9797 9.5894 7.2871 0.0806 2.5835 2.8177 2.9660 2.7986 0.0304 0.0007 4.5404 4.9486 1.6088 1.6009 4.3325 4.3685 0.0064 0.3859 0.3853 0.0062 5.9633 5.1898 3.4225 0.0389 0.0319 1.3212 0.0024 0.3437 0.4012 0.2972 0.0062 16.3195 3.9122 4.9341 1.2756 0.0729 0.0923 0.0040 0.0227 0.0691 0.2773 0.0968 0.1993 0.6647 0.0316 0.2343 0.1826 0.4563 4.0194 3.9851 6.9274 4.6984 24.5066 17.4934 18.6798 6.4143 3.0591 3.1295 54.2053 27.0526 26.9209 66.4376 1.9977 1.2683 3.4173 111.0803 122.9529 11.3899 86.0538 89.1119 1.7870 3.7313 22.9648 23.1334 3.5658 1.1423 169.3872
temp: 298.150 k
press: 1.00000 atm
elementType: 17 6 6 6 6 6 6 6 6 6 6 6 6 6 1 1 1 1 1 1 1 1 1 1 1 1 1 1 1 1 1 1 1 1 1
symmnumber: 1
zpe: 821962.6 jmol-1
zpe.correction: 0.313069 hartree
zpe.thermalcorrener: 0.325516 hartree
zpe.thermalcorrenthalpy: 0.326460 hartree
zpe.thermalcorrgfe: 0.275923 hartree
zpe.sumelectzpe: -966.962905 hartree
zpe.sumelectthermal: -966.950458 hartree
zpe.sumelectthermalent: -966.949514 hartree
zpe.sumelectthermalfe: -967.000051 hartree
dipole: 0.0045 0.0007 -2.3957
dipole: 2.3957
quadrupole: -92.1603 -92.1763 -95.8941
quadrupole: 0.0024 -0.0027 0.0056
quadrupole: 1.2499 1.2340 -2.4839 0.0024 -0.0027 0.0056
hfenergy: -967.2759738 hartree
pointgroup: C01 [X(C13H21Cl1)]
dipole: 0.0003367 0.0017614 0.9425542 debye
polarizability: 145.1209773|-0.0130408|145.1905546|0.0011264|0.0117422|123.0901334 unknown
InChI: InChI=1S/C13H21Cl/c14-13-10-4-1-5-11(13)7-3-9-12(13)8-2-6-10/h10-12H,1-9H2
charge 0 multiplicity 1
35 atoms
Cl -0.001262 -0.002265 -2.033477
C  -0.00053 -0.000425 -0.060655
C  -1.477498 0.155967 0.381994
C  0.604385 -1.358553 0.382103
C  0.873627 1.201058 0.382831
C  -2.346407 -1.051176 -0.041709
C  -2.07504 1.517821 -0.044798
C  -0.27642 -2.557577 -0.040891
C  2.082587 -1.506552 -0.045437
C  0.263735 2.558311 -0.040302
C  2.351746 1.039526 -0.04135
C  -1.739862 -2.393429 0.433677
C  -1.202612 2.704353 0.430581
C  2.942539 -0.311152 0.430328
H  -1.424883 0.152402 1.497492
H  0.582457 -1.30873 1.497715
H  0.841667 1.1565 1.498235
H  -2.441893 -1.052937 -1.144656
H  -3.365442 -0.923853 0.374128
H  -3.098576 1.607353 0.369874
H  -2.167031 1.538876 -1.147846
H  0.158083 -3.487163 0.37728
H  -0.247442 -2.652039 -1.143545
H  2.128379 -1.586141 -1.148644
H  2.48309 -2.453557 0.367346
H  0.314759 2.644068 -1.142988
H  0.882721 3.376085 0.379035
H  2.939302 1.880153 0.377819
H  2.418314 1.113385 -1.144049
H  -1.771769 -2.436248 1.542973
H  -2.354369 -3.237083 0.064569
H  -1.625491 3.657459 0.058466
H  -1.227374 2.755144 1.539611
H  2.99655 -0.318829 1.539517
H  3.97996 -0.420657 0.059672
