program: Gaussian 09
title: 000286972
version: EM64L-G09RevD.01
frameworkgroup: C1[X(C13H22O)]
method: RPBEPBE
basis: SDD
operation: Freq
keyword: #pfreq=noraman
keyword: PBEPBE/SDD
title: #p freq=noraman PBEPBE/SDD
converged: NO YES NO NO
title: Mulliken charges:
elementType: O C C C C C C C C C C C C C H H H H H H H H H H H H H H H H H H H H H H
charge: -0.481519 0.256274 -0.102498 -0.100750 -0.098489 -0.482464 -0.435521 -0.482423 -0.435808 -0.450988 -0.450858 -0.423911 -0.427517 -0.427946 0.207066 0.206847 0.208890 0.191526 0.210450 0.187024 0.208131 0.210101 0.191827 0.208482 0.186871 0.224431 0.187620 0.187573 0.224523 0.197207 0.207722 0.201970 0.188658 0.188806 0.201994 0.316698
chargesum: 0.00000
title: Mulliken charges with hydrogens summed into heavy atoms:
elementType: O C C C C C C C C C C C C C
charge: -0.164822 0.256274 0.104569 0.106096 0.110402 -0.080487 -0.040366 -0.080495 -0.040455 -0.038937 -0.038762 -0.018982 -0.036889 -0.037145
polarizability: 1.44389649e+02 -1.49804913e-02 1.42444718e+02 5.65857424e-01 -1.93194771e-03 1.10415138e+02
1716.lowfreq: -23.8863 -0.0008 -0.0008 -0.0003 15.5152 21.2399 118.4883 122.6633 177.4266
frequency: 118.4763 122.6490 177.4226 190.7333 210.4347 243.6561 256.2320 296.4284 301.9344 309.8655 354.1926 356.2887 374.6452 375.9767 444.0733 456.2073 498.6354 533.4626 535.4077 558.7675 565.8023 687.3225 817.2135 823.4887 824.0786 828.4492 856.2910 860.2332 885.3314 888.4997 891.6130 939.4894 972.5195 977.0714 984.0018 1000.7954 1009.0380 1026.4882 1034.8597 1080.1956 1088.4017 1102.2118 1104.0592 1107.7889 1127.9969 1149.3349 1154.7062 1157.9021 1164.0789 1166.2333 1212.9406 1218.9965 1221.3419 1252.8986 1263.9147 1274.9761 1277.6092 1282.0767 1286.5196 1321.5027 1325.9781 1331.4786 1334.4988 1339.5466 1339.9505 1342.3435 1342.6894 1346.5799 1351.2833 1353.4169 1360.3635 1448.2852 1450.5547 1459.6421 1464.8831 1466.8394 1467.2879 1470.0592 1471.0111 1481.0824 2926.2118 2929.6117 2936.4186 2941.9231 2947.8425 2955.4813 2956.4009 2966.5222 2969.0490 2970.0511 2975.3970 2980.3117 3013.2230 3017.1279 3020.4850 3022.5800 3029.8742 3030.1155 3033.7453 3042.6234 3048.9420 3553.4213
redmass: 2.6275 2.6765 1.8523 2.8180 1.1656 3.0664 3.5796 1.9921 1.9816 2.1402 3.4727 3.2788 3.0316 3.0246 3.7120 3.7439 1.9716 1.7957 1.8311 2.2597 2.5399 3.6931 2.1046 1.4633 1.7153 1.9889 2.1804 2.2220 1.8598 1.7186 2.5111 2.3988 2.5092 1.7434 1.6078 1.6326 1.8421 1.7835 2.1665 1.1923 2.3052 1.8071 1.5839 1.6182 2.0743 1.5599 2.6434 2.3970 2.2315 1.2992 1.3812 1.4425 1.3986 1.3392 1.3539 1.3667 1.2260 1.2235 1.1982 1.4939 1.5429 1.4263 1.4488 1.4975 1.5098 1.4416 1.4302 1.5790 1.6079 1.5024 1.6560 1.0891 1.0890 1.0866 1.0871 1.0855 1.0927 1.0910 1.0864 1.0865 1.0813 1.0789 1.0725 1.0692 1.0758 1.0630 1.0631 1.0622 1.0606 1.0608 1.0626 1.0624 1.0950 1.0938 1.0963 1.0945 1.1021 1.1022 1.1022 1.1018 1.1009 1.0652
irintensity: 0.2410 0.1813 12.4588 0.1931 120.0224 2.7532 0.3321 1.0762 1.9133 0.5197 2.0587 0.2657 0.5369 0.6511 0.0572 0.2020 1.2207 1.4082 0.9743 4.6501 2.4839 1.8130 12.2983 2.0128 2.1747 11.1235 2.8188 2.2686 16.4556 5.8507 31.3510 8.7105 0.0506 8.7628 3.6944 5.4656 2.8755 8.7557 1.4242 0.2482 18.0953 1.6117 1.6142 0.0225 11.8636 0.1866 1.2920 1.2903 3.4362 0.0139 14.2523 0.3629 8.8945 0.1771 16.8361 3.1293 2.6475 3.3161 0.0606 0.8134 0.2364 0.4715 0.0345 0.1789 0.5068 0.4660 0.5532 1.1244 0.0893 0.5271 10.3361 2.8541 6.0317 0.0222 15.1939 6.6754 4.6711 15.9556 12.0627 14.9090 5.0206 0.2802 4.8667 20.5349 68.4573 28.5271 59.9984 39.7797 73.5493 31.9009 0.8899 92.4613 16.7824 63.0397 139.0195 2.3466 11.2255 61.4039 85.2218 2.7174 127.2299 0.7024
temp: 298.150 k
press: 1.00000 atm
elementType: 8 6 6 6 6 6 6 6 6 6 6 6 6 6 1 1 1 1 1 1 1 1 1 1 1 1 1 1 1 1 1 1 1 1 1 1
symmnumber: 1
zpe: 854246.7 jmol-1
zpe.correction: 0.325365 hartree
zpe.thermalcorrener: 0.337967 hartree
zpe.thermalcorrenthalpy: 0.338911 hartree
zpe.thermalcorrgfe: 0.288441 hartree
zpe.sumelectzpe: -582.702397 hartree
zpe.sumelectthermal: -582.689796 hartree
zpe.sumelectthermalent: -582.688852 hartree
zpe.sumelectthermalfe: -582.739322 hartree
dipole: 1.5003 -0.0187 -0.9555
dipole: 1.7788
quadrupole: -85.9522 -87.7697 -87.1258
quadrupole: -0.0184 2.6102 -0.0260
quadrupole: 0.9970 -0.8205 -0.1766 -0.0184 2.6102 -0.0260
hfenergy: -583.0277628 hartree
pointgroup: C01 [X(C13H22O1)]
dipole: -0.2801931 -0.5180952 0.3779677 debye
polarizability: 142.8978113|0.8235726|143.9397842|0.1251912|0.4406586|110.411909 unknown
InChI: InChI=1S/C13H22O/c14-13-10-4-1-5-11(13)7-3-9-12(13)8-2-6-10/h10-12,14H,1-9H2
charge 0 multiplicity 1
36 atoms
O  0.031199 0.069512 -1.61158
C  0.001947 0.000803 -0.124753
C  -1.478316 -0.051519 0.37439
C  0.787438 -1.258215 0.364746
C  0.69851 1.304559 0.35386
C  -2.17393 -1.36473 -0.063118
C  -2.258249 1.206436 -0.074356
C  0.083335 -2.565919 -0.074425
C  2.264491 -1.203314 -0.0903
C  -0.094623 2.555176 -0.092923
C  2.175801 1.344694 -0.103184
C  -1.389252 -2.616131 0.397398
C  -1.562686 2.506452 0.391764
C  2.957775 0.098559 0.374137
H  -1.431976 -0.053959 1.486508
H  0.765807 -1.225489 1.477341
H  0.684135 1.266913 1.467096
H  -2.292489 -1.378501 -1.169346
H  -3.202846 -1.386143 0.346399
H  -3.293815 1.158791 0.318682
H  -2.325322 1.20777 -1.180676
H  0.643301 -3.433944 0.325295
H  0.127906 -2.664247 -1.18171
H  2.298874 -1.257987 -1.19687
H  2.803932 -2.089746 0.300043
H  -0.072474 2.611236 -1.198142
H  0.407418 3.464085 0.295058
H  2.652887 2.267761 0.283008
H  2.202324 1.396187 -1.208603
H  -1.410778 -2.665701 1.505834
H  -1.880697 -3.53604 0.025647
H  -2.117089 3.389482 0.018885
H  -1.586136 2.557201 1.501296
H  3.020749 0.105346 1.483189
H  3.997447 0.131908 -0.005572
H  -0.412698 -0.741281 -1.967917
