program: Gaussian 09
title: 000286970
version: EM64L-G09RevD.01
frameworkgroup: C1[X(C12H12N2S)]
method: RPBEPBE
basis: SDD
operation: Freq
keyword: #p
keyword: freq=noraman
keyword: PBEPBE/SDD
title: #p freq=noraman PBEPBE/SDD
converged: YES YES NO NO
title: Mulliken charges:
elementType: S N N C C C C C C C C C C C C H H H H H H H H H H H H
charge: 0.269754 -0.446424 -0.034025 0.226722 -0.214640 0.468427 -0.294978 -0.795181 -0.421409 -0.368146 -0.142090 -0.191759 -0.192280 -0.522056 -0.267075 0.234807 0.293951 0.252991 0.237965 0.238324 0.213994 0.276719 0.242187 0.222030 0.223632 0.261856 0.226705
chargesum: 0.00000
title: Mulliken charges with hydrogens summed into heavy atoms:
elementType: S N N C C C C C C C C C C C C
charge: 0.269754 -0.152473 -0.034025 0.226722 -0.214640 0.468427 -0.060171 -0.065902 -0.207415 -0.091427 0.100097 0.030271 0.031352 -0.260200 -0.040370
polarizability: 3.45375711e+02 -2.54537734e+00 1.69746369e+02 6.74384001e-03 -3.55020440e-02 6.55450770e+01
1716.lowfreq: -7.8156 -5.4434 -0.0007 0.0017 0.0023 3.5489 31.5056 45.1054 56.2790
frequency: 31.4899 45.0679 56.2637 75.0997 124.0873 149.9497 167.6913 236.4885 244.1556 308.8614 312.3719 370.0547 408.0156 439.7124 493.9502 502.0604 517.9310 560.8854 563.7495 594.8882 611.3411 621.3531 681.8404 692.2075 694.1970 707.8294 758.7032 810.3324 813.6800 831.7359 858.6877 898.9908 902.4436 927.6556 964.4028 981.4409 988.6303 1014.8572 1020.3419 1027.7312 1062.1936 1080.8061 1092.5669 1139.2862 1169.1682 1177.9166 1221.0625 1270.2971 1302.7455 1322.7363 1349.3545 1386.6723 1391.5816 1433.2769 1461.8668 1475.6197 1477.2006 1484.4779 1507.4795 1547.0168 1554.0545 1600.6488 1615.7949 2959.2533 3027.6580 3108.6535 3124.9919 3130.0824 3141.5383 3163.6493 3166.8362 3183.5698 3184.9811 3234.2617 3435.3138
redmass: 4.6828 4.4747 5.9375 2.9353 1.3565 2.8738 5.8986 4.8822 4.4072 3.8814 3.9995 5.3975 2.9196 2.2423 6.8476 2.6124 2.9660 5.2044 2.3966 2.7303 6.9708 7.5957 5.5334 1.1767 1.8785 4.7467 1.7263 1.3527 4.6619 1.2593 4.0468 1.4464 1.3594 4.5912 1.3515 6.0114 1.3094 2.0177 2.0548 1.5168 1.7620 1.5705 1.1257 3.3436 1.0546 1.1094 1.5564 2.5394 1.8838 1.8378 2.7112 6.0477 1.2478 2.1048 1.3888 4.1530 1.0441 2.2815 2.1726 5.6397 4.4530 4.8421 6.1890 1.0413 1.0980 1.0880 1.0928 1.0865 1.0931 1.0987 1.0891 1.0957 1.0968 1.1001 1.0742
irintensity: 0.0847 0.4840 0.0026 0.9840 6.3345 0.5294 4.3615 0.0543 1.2751 0.4101 4.5257 6.5840 0.0401 13.4202 2.5231 49.0751 3.8548 4.2339 23.8612 6.2063 0.1199 2.2515 7.2153 80.8935 73.7894 12.2586 81.5077 17.5886 13.3673 0.0086 5.0685 10.1993 0.0118 15.3810 0.0013 3.7383 1.4482 17.3763 11.9781 3.5980 31.9852 10.3938 0.5550 103.9226 0.9138 9.0606 32.3610 182.5119 3.5854 4.2587 15.8137 18.1890 26.7161 4.7963 18.2363 13.2863 16.3804 150.4337 35.9044 238.6315 0.3261 4.2495 207.5526 23.5041 19.1873 16.1477 8.8107 0.5807 32.3759 39.2413 13.6674 3.2526 11.0176 0.4976 1.5376
temp: 298.150 k
press: 1.00000 atm
elementType: 16 7 7 6 6 6 6 6 6 6 6 6 6 6 6 1 1 1 1 1 1 1 1 1 1 1 1
symmnumber: 1
zpe: 550257.0 jmol-1
zpe.correction: 0.209582 hartree
zpe.thermalcorrener: 0.223380 hartree
zpe.thermalcorrenthalpy: 0.224324 hartree
zpe.thermalcorrgfe: 0.167459 hartree
zpe.sumelectzpe: -970.936014 hartree
zpe.sumelectthermal: -970.922216 hartree
zpe.sumelectthermalent: -970.921272 hartree
zpe.sumelectthermalfe: -970.978137 hartree
dipole: -0.5414 3.0892 0.0012
dipole: 3.1363
quadrupole: -83.5346 -79.8201 -103.4144
quadrupole: 0.8102 0.0058 -0.0064
quadrupole: 5.3884 9.1029 -14.4913 0.8102 0.0058 -0.0064
hfenergy: -971.1455956 hartree
pointgroup: C01 [X(C12H12N2S1)]
dipole: 0.251882 1.2077134 0.0236305 debye
polarizability: 345.3134108|-3.0121493|169.7074479|-3.6053004|2.427027|65.6462987 unknown
InChI: InChI=1S/C12H12N2S/c1-10(12-8-5-9-15-12)13-14-11-6-3-2-4-7-11/h2-9,14H,1H3
charge 0 multiplicity 1
27 atoms
S  2.519719 -1.627103 -0.099727
N  -0.93299 0.998881 0.004318
N  0.246759 0.303302 -0.026683
C  1.394977 0.978688 -0.027014
C  2.617274 0.18907 -0.059768
C  -2.170496 0.319347 0.004542
C  3.952772 0.603197 -0.066317
C  1.464369 2.497359 0.004929
C  -3.367401 1.085148 0.038454
C  -2.237264 -1.099102 -0.028396
C  4.904251 -0.476635 -0.101885
C  -4.618786 0.435237 0.039454
C  -3.496804 -1.731789 -0.0269
C  4.311918 -1.729586 -0.123299
C  -4.694469 -0.977121 0.006844
H  4.256374 1.652556 -0.045858
H  -0.947607 2.025934 0.027233
H  2.501975 2.858232 -0.004644
H  0.953503 2.940635 -0.873938
H  0.983064 2.901381 0.918665
H  -3.318202 2.181842 0.06368
H  -1.307887 -1.67288 -0.054423
H  5.986381 -0.325027 -0.111166
H  -5.535901 1.034565 0.065738
H  -3.543243 -2.826571 -0.052373
H  4.784931 -2.709829 -0.151107
H  -5.667321 -1.479629 0.007738
