program: Gaussian 09
title: 000286965
version: EM64L-G09RevD.01
frameworkgroup: C1[X(C18H12N2O)]
method: RPBEPBE
basis: SDD
operation: Freq
keyword: #p
keyword: freq=noraman
keyword: PBEPBE/SDD
title: #p freq=noraman PBEPBE/SDD
converged: YES YES NO NO
title: Mulliken charges:
elementType: O N N C C C C C C C C C C C C C C C C C C H H H H H H H H H H H H
charge: -0.257579 0.038267 -0.416234 -0.185772 0.422518 0.403884 0.520259 -0.289748 -0.171380 -0.445545 -0.439165 -0.429985 -0.414444 -0.206069 -0.216341 0.451923 -0.405956 -0.357748 -0.188450 -0.191081 -0.256332 0.266849 0.276226 0.241079 0.242050 0.224706 0.229791 0.359713 0.236402 0.272812 0.227985 0.226964 0.230403
chargesum: 0.00000
title: Mulliken charges with hydrogens summed into heavy atoms:
elementType: O N N C C C C C C C C C C C C C C C C C C
charge: -0.257579 0.038267 -0.056521 -0.185772 0.422518 0.403884 0.520259 -0.289748 -0.171380 -0.178696 -0.162940 -0.188906 -0.172395 0.018637 0.013450 0.451923 -0.169554 -0.084936 0.039535 0.035883 -0.025929
polarizability: 4.77720699e+02 3.55552960e+00 2.44987770e+02 7.44742588e-03 -2.83542179e-02 7.79523156e+01
1716.lowfreq: -4.3787 -0.0001 0.0005 0.0008 3.8740 7.8423 35.8270 44.1049 57.7708
frequency: 35.8065 44.0815 57.7708 110.7214 135.7897 174.4617 180.0267 211.5513 218.9940 261.8506 305.9108 329.1070 407.1520 407.1933 410.7381 448.2382 451.1721 462.4878 481.2312 513.5662 520.7018 562.2715 575.1715 612.8505 618.5428 637.0137 659.8818 683.0379 693.3583 749.2780 766.4887 785.2296 792.8347 810.5492 829.1695 836.1932 859.7691 881.0333 910.5086 913.5983 921.1716 927.8929 943.0120 973.8299 983.9666 985.3892 993.4750 995.3114 1012.1893 1020.2079 1035.9498 1068.8326 1085.9256 1113.6445 1171.0296 1171.7707 1178.5937 1187.3353 1191.2448 1232.7031 1242.0802 1279.6970 1285.7192 1321.8281 1358.0013 1387.9771 1396.9001 1422.2376 1434.7551 1452.8266 1460.1016 1474.8914 1489.3771 1494.4062 1541.7829 1574.1721 1606.1320 1610.7515 1611.8895 1613.9649 1631.4318 3125.2230 3128.1827 3128.9273 3134.5922 3147.3103 3147.3439 3148.4581 3164.3321 3165.3632 3166.1588 3181.7063 3195.5955
redmass: 5.5421 4.0563 5.4914 6.4223 6.9371 4.0007 5.7349 6.2902 4.7251 4.3907 8.7792 5.0382 5.2270 2.9649 7.3153 6.8429 4.5079 3.2120 8.1880 3.0741 6.4937 7.1585 7.6458 6.4868 3.7981 3.5354 7.7096 7.0671 1.8945 1.5440 1.7053 1.8452 5.2544 2.3506 5.2200 1.2976 2.8076 1.2656 6.4342 1.4415 1.4524 6.7106 1.4686 1.3605 6.1294 1.3719 1.3124 1.3885 3.2184 2.1408 2.1673 2.5963 1.7024 2.5986 1.0689 1.2987 1.1242 1.5154 2.0336 1.7459 2.8063 3.0309 2.4927 1.3825 2.5047 7.0654 4.4971 1.9538 2.7698 3.0896 5.3078 2.9940 3.5156 4.0701 4.3227 4.1759 4.5338 5.0566 6.4391 7.3176 7.9481 1.0869 1.0871 1.0864 1.0878 1.0925 1.0937 1.0932 1.0979 1.0973 1.0985 1.0961 1.0815
irintensity: 0.8401 0.5654 0.3945 0.3947 0.1236 4.3058 5.7294 0.0460 0.0544 0.8249 3.7544 1.1566 1.5513 0.2086 23.2612 2.4097 0.3104 0.1246 2.8200 13.5754 33.3977 3.0277 3.4001 0.8693 0.7857 1.3668 11.4356 1.7407 39.8926 0.9466 66.6186 79.9104 2.7603 0.2435 2.1533 7.7679 57.8206 85.1598 3.5282 17.5308 2.1421 77.0271 0.0131 0.2005 0.2765 0.7087 1.3865 2.7379 33.8615 4.4156 82.6769 138.2717 37.0730 4.9425 0.0391 4.3991 1.0374 6.2667 106.8456 12.3160 94.6182 6.1988 265.0182 2.9118 6.5122 5.6685 6.2436 1.4975 44.8274 17.7538 113.8537 70.7029 24.5683 43.0744 656.2386 73.2810 4.9579 31.1967 12.8290 19.8306 2.5340 8.5876 3.1989 0.9591 1.2074 11.3706 23.9286 29.4824 36.0897 17.5036 36.1910 8.4199 29.3614
temp: 298.150 k
press: 1.00000 atm
elementType: 8 7 7 6 6 6 6 6 6 6 6 6 6 6 6 6 6 6 6 6 6 1 1 1 1 1 1 1 1 1 1 1 1
symmnumber: 1
zpe: 658322.5 jmol-1
zpe.correction: 0.250742 hartree
zpe.thermalcorrener: 0.266081 hartree
zpe.thermalcorrenthalpy: 0.267025 hartree
zpe.thermalcorrgfe: 0.207393 hartree
zpe.sumelectzpe: -876.437294 hartree
zpe.sumelectthermal: -876.421955 hartree
zpe.sumelectthermalent: -876.421010 hartree
zpe.sumelectthermalfe: -876.480642 hartree
dipole: -1.3097 1.1784 0.0071
dipole: 1.7618
quadrupole: -89.6741 -110.8786 -128.2095
quadrupole: -0.5111 0.0091 -0.0289
quadrupole: 19.9133 -1.2912 -18.6221 -0.5111 0.0091 -0.0289
hfenergy: -876.6880357 hartree
pointgroup: C01 [X(C18H12N2O1)]
dipole: 0.5214685 -0.4566115 0.0029526 debye
polarizability: 477.5823164|6.6954319|245.1261537|0.0143298|-0.0234202|77.9523145 unknown
InChI: InChI=1S/C18H12N2O/c21-18-15-11-5-7-12-6-4-10-14(16(12)15)17(18)20-19-13-8-2-1-3-9-13/h1-11,19H
charge 0 multiplicity 1
33 atoms
O  -0.088469 2.43206 -0.00334
N  -1.074387 -0.443791 0.0000
N  -2.039388 0.506185 0.000692
C  2.525507 -0.041072 0.000289
C  1.379078 -0.901919 0.00058
C  2.165363 1.342031 -0.000382
C  3.868622 -0.503875 0.000399
C  0.198264 -0.022325 0.000035
C  0.676738 1.400586 -0.000038
C  1.584101 -2.284632 0.001198
C  3.168859 2.315847 -0.001263
C  4.05437 -1.93037 0.001116
C  4.883597 0.512562 -0.000273
C  2.934874 -2.778881 0.00151
C  4.533943 1.877037 -0.001128
C  -3.406212 0.150218 0.000076
C  -4.369011 1.194288 0.001291
C  -3.821741 -1.207175 -0.001689
C  -5.742887 0.877112 0.000727
C  -5.198223 -1.506461 -0.002238
C  -6.166678 -0.472649 -0.001042
H  0.742958 -2.984556 0.001445
H  2.925013 3.382987 -0.001877
H  5.065753 -2.352502 0.001297
H  5.941454 0.223468 -0.000233
H  3.090705 -3.863696 0.002009
H  5.330089 2.629663 -0.0017
H  -1.743741 1.506345 0.002271
H  -4.041622 2.241104 0.002672
H  -3.064171 -1.994769 -0.002593
H  -6.48202 1.685613 0.001673
H  -5.519369 -2.55412 -0.003605
H  -7.234369 -0.715716 -0.001476
