program: Gaussian 09
title: 000286996
version: EM64L-G09RevD.01
frameworkgroup: C1[X(C15H14O5)]
method: RPBEPBE
basis: SDD
operation: Freq
keyword: #pfreq=noraman
keyword: PBEPBE/SDD
title: #p freq=noraman PBEPBE/SDD
converged: YES YES NO NO
title: Mulliken charges:
elementType: O O O O O C C C C C C C C C C C C C C C H H H H H H H H H H H H H H
charge: -0.282950 -0.275124 -0.304754 -0.265385 -0.195547 -0.264613 -0.260693 0.462537 0.321861 0.152493 -0.368234 -0.408349 0.239499 -0.234140 -0.227900 -0.237907 -0.470116 -0.494994 0.143550 -0.513749 0.261636 0.301961 0.263015 0.235351 0.226833 0.228138 0.230119 0.276271 0.240183 0.261370 0.231872 0.252534 0.236969 0.238262
chargesum: 0.00000
title: Mulliken charges with hydrogens summed into heavy atoms:
elementType: O O O O O C C C C C C C C C C C C C C C
charge: -0.282950 -0.275124 -0.304754 -0.265385 -0.195547 -0.002977 0.041268 0.462537 0.321861 0.152493 -0.105219 -0.172998 0.239499 -0.007307 0.000238 -0.007788 -0.193845 0.238431 0.143550 0.214017
polarizability: 2.92132288e+02 3.86880937e+00 1.88560726e+02 -4.27011370e+00 9.89073615e+00 1.18398151e+02
1716.lowfreq: -14.5854 -6.5470 -0.0008 -0.0005 -0.0003 2.6522 19.0494 26.6942 33.6145
frequency: 18.3946 26.6387 33.5282 54.3276 78.8303 103.4711 113.6831 143.3387 146.7140 160.9950 177.2877 180.7615 197.1635 206.2809 218.0824 272.3394 281.6854 334.5828 386.9478 401.5708 402.9877 422.6756 465.2980 519.3298 552.4456 569.9987 611.1700 616.0065 632.5890 655.4322 662.3525 675.0733 702.4817 724.7319 739.4506 762.9235 781.2353 789.1830 799.1817 828.9144 855.1643 917.8088 926.2862 947.1630 978.0036 988.8868 996.7503 1023.7737 1041.3105 1057.1340 1065.9929 1083.7837 1090.6408 1107.1794 1113.8203 1135.2883 1152.0608 1163.7709 1172.7886 1181.9898 1185.9317 1211.0887 1232.6454 1279.2519 1305.1583 1328.9108 1364.5719 1385.1842 1399.7667 1429.6864 1439.9550 1442.7655 1455.1014 1460.0293 1462.9520 1467.4472 1485.6020 1561.0156 1592.1766 1615.1728 1629.3704 1720.1936 2983.7709 3012.6057 3082.6736 3114.0550 3120.1629 3126.5847 3127.7982 3139.9089 3146.3568 3147.6644 3150.8899 3164.9205 3165.5854 3243.6934
redmass: 3.9586 6.4639 5.2867 3.4200 4.9088 3.4273 6.1040 2.1907 3.8424 1.8365 1.9235 3.9831 3.4310 5.5185 2.0658 5.1642 4.6906 4.6829 6.3589 4.6549 2.9725 8.0403 7.5776 3.3546 8.4922 7.2319 7.2494 7.3311 8.3557 7.5432 4.4090 3.3099 2.0573 3.4733 6.6537 2.7439 8.0446 1.6802 4.3051 4.8081 1.2510 2.4838 2.3285 7.6224 1.3864 6.0106 1.3175 2.3166 3.4754 2.9201 1.5004 1.4257 1.3706 1.2477 1.2545 3.1460 1.3043 1.8238 1.0606 2.1453 1.3750 2.3934 1.6197 3.7287 1.5228 1.3048 3.5327 6.0974 2.6009 1.3238 1.2001 2.1948 1.0507 1.0554 1.0496 1.0523 2.4340 6.3644 6.1098 6.0365 9.0914 12.1613 1.0313 1.0288 1.1053 1.0893 1.0865 1.1042 1.0870 1.0916 1.1021 1.1067 1.0960 1.1008 1.0908 1.0971
irintensity: 0.3039 3.2628 0.3823 6.4623 1.9825 0.6903 2.6275 0.5660 1.8872 3.4477 1.3436 2.5582 4.7338 2.4581 2.8935 1.7791 3.4935 5.6659 1.6041 6.3882 0.9332 2.7996 3.5247 16.4611 6.1956 7.1947 11.1722 11.9440 8.7460 1.0277 14.0371 2.0724 35.0545 13.4964 42.6280 100.4245 124.6748 55.8321 14.9119 17.3813 0.0437 9.8840 8.2688 30.2718 0.0058 0.1850 0.1077 11.0018 77.5392 58.2282 7.3893 9.6006 18.4165 1.7088 0.0764 90.9080 0.3920 150.1767 0.1061 1.8437 7.8724 10.0583 5.8670 70.1797 23.8811 5.0858 49.7908 11.6756 44.7570 26.9521 8.4445 9.2199 17.8167 17.9405 16.0245 19.6598 11.4558 253.5126 0.8891 5.6337 287.3568 704.4302 41.4661 38.8858 28.1433 3.1640 7.1451 20.3605 0.4783 16.6241 9.9731 14.2178 28.8166 32.1967 3.2499 1.8665
temp: 298.150 k
press: 1.00000 atm
elementType: 8 8 8 8 8 6 6 6 6 6 6 6 6 6 6 6 6 6 6 6 1 1 1 1 1 1 1 1 1 1 1 1 1 1
symmnumber: 1
zpe: 673679.0 jmol-1
zpe.correction: 0.256591 hartree
zpe.thermalcorrener: 0.275577 hartree
zpe.thermalcorrenthalpy: 0.276522 hartree
zpe.thermalcorrgfe: 0.206963 hartree
zpe.sumelectzpe: -954.573391 hartree
zpe.sumelectthermal: -954.554404 hartree
zpe.sumelectthermalent: -954.553460 hartree
zpe.sumelectthermalfe: -954.623019 hartree
dipole: -3.2253 3.2985 -0.4903
dipole: 4.6393
quadrupole: -137.0853 -89.1525 -120.7675
quadrupole: 3.9343 13.8648 4.4689
quadrupole: -21.4169 26.5159 -5.0991 3.9343 13.8648 4.4689
hfenergy: -954.8299816 hartree
pointgroup: C01 [X(C15H14O5)]
dipole: 1.1600314 -1.3777381 -0.2960964 debye
polarizability: 289.1802675|-7.9725937|190.3892155|21.0926618|0.6932988|119.5216818 unknown
InChI: InChI=1S/C15H14O5/c1-17-10-8-11(16)19-13(10)14(18-2)15-12(20-15)9-6-4-3-5-7-9/h3-8,12,15H,1-2H3
charge 0 multiplicity 1
34 atoms
O  1.12038 0.454257 1.775618
O  -0.510439 2.410254 0.336946
O  -3.00271 1.286023 -0.757956
O  -1.346487 -1.926158 -0.377506
O  -5.153205 0.836644 -1.628537
C  1.853664 0.904175 0.535518
C  0.491425 0.258277 0.401229
C  3.0985 0.163766 0.164991
C  -0.720144 1.065476 0.10291
C  -1.882345 0.493922 -0.384148
C  3.362141 -1.128127 0.687714
C  4.028624 0.755655 -0.726851
C  -2.234052 -0.90618 -0.636224
C  4.533288 -1.820611 0.313873
C  5.197131 0.058365 -1.106088
C  5.451812 -1.232846 -0.588577
C  -3.524717 -0.97378 -1.140193
C  -1.631598 3.369935 0.485106
C  -4.067982 0.372006 -1.243585
C  -1.827197 -3.292991 -0.658373
H  1.878015 1.99612 0.430889
H  0.450828 -0.788584 0.091272
H  2.660548 -1.559606 1.410573
H  3.837214 1.759971 -1.124746
H  4.736019 -2.813982 0.729805
H  5.909289 0.52278 -1.797271
H  6.361385 -1.771128 -0.877566
H  -4.094007 -1.853142 -1.43036
H  -2.35442 2.997828 1.229826
H  -2.142135 3.526401 -0.476378
H  -1.146661 4.291548 0.838657
H  -0.992398 -3.953342 -0.386555
H  -2.070232 -3.401091 -1.73114
H  -2.714735 -3.520536 -0.040574
