program: Gaussian 09
title: 000286966
version: EM64L-G09RevD.01
frameworkgroup: C1[X(C17H14N2S)]
method: RPBEPBE
basis: SDD
operation: Freq
keyword: #p
keyword: freq=noraman
keyword: PBEPBE/SDD
title: #p freq=noraman PBEPBE/SDD
converged: YES YES NO NO
title: Mulliken charges:
elementType: S N N C C C C C C C C C C C C C C C C C H H H H H H H H H H H H H H
charge: 0.267298 -0.022951 -0.445906 0.062112 0.322756 -0.290495 -0.367375 -0.379936 0.467501 -0.281833 -0.231366 -0.230411 -0.245156 -0.140013 -0.421641 -0.367757 -0.512516 -0.191190 -0.192250 -0.265720 0.250754 0.258733 0.287865 0.311170 0.224582 0.224991 0.227814 0.249100 0.220599 0.269732 0.267169 0.223143 0.223738 0.227460
chargesum: 0.00000
title: Mulliken charges with hydrogens summed into heavy atoms:
elementType: S N N C C C C C C C C C C C C C C C C C
charge: 0.267298 -0.022951 -0.134736 0.062112 0.322756 -0.290495 -0.116620 -0.121203 0.467501 0.006031 -0.006784 -0.005419 -0.017341 0.109086 -0.201042 -0.098025 -0.245347 0.031952 0.031488 -0.038260
polarizability: 3.73855101e+02 3.59694101e+00 2.60433203e+02 1.39287023e+00 9.86189922e+00 1.11205186e+02
1716.lowfreq: 0.0010 0.0011 0.0022 3.2777 5.0481 6.7053 26.4840 41.5328 47.5330
frequency: 26.4770 41.4851 47.5122 53.4173 59.7993 76.3138 117.2112 169.8208 198.5348 222.7474 240.3693 270.1930 296.9025 328.3778 406.9584 408.5358 435.1904 451.7594 474.4410 507.1910 534.9050 561.3915 593.5559 613.7421 615.4231 625.7728 642.0058 665.8943 684.5290 695.1601 699.8533 702.4679 708.6479 760.4301 776.7629 812.3320 831.6248 832.3978 849.6381 854.8641 900.0965 915.9954 928.8425 932.4049 966.3058 981.7224 983.4905 987.4495 988.4384 997.1048 1013.8637 1020.5327 1033.3520 1065.6184 1078.7286 1084.1133 1101.8561 1161.3956 1169.0465 1171.4811 1176.9265 1187.9477 1215.3533 1269.8377 1292.5015 1317.0805 1319.7564 1346.6777 1381.3196 1386.1111 1431.5611 1436.8613 1465.1981 1475.3018 1482.0918 1490.2470 1519.9707 1534.6227 1582.5901 1598.7174 1609.5843 1615.6034 3113.3631 3123.3371 3130.7877 3132.5522 3142.6609 3146.4487 3157.5338 3159.0958 3164.3046 3167.9868 3182.5465 3183.8158 3234.5204 3379.0309
redmass: 5.7900 3.8868 5.2228 5.1674 4.8721 5.2452 5.4886 5.1341 5.8646 5.8085 5.2408 5.4767 4.8020 4.9088 2.8761 2.9183 5.7998 5.2551 4.6335 2.8882 4.7773 4.4761 6.3575 6.3863 5.7642 2.0426 3.3427 5.7824 3.3698 1.9745 1.7977 2.3607 1.8082 1.7192 1.9513 4.7345 3.3150 1.4440 1.2637 1.2512 1.4464 1.4036 1.6011 3.6449 1.3565 5.6130 1.4542 3.0709 1.5892 1.3179 2.9928 2.1499 1.9042 1.9500 1.4493 1.5098 1.5224 3.3414 1.0626 1.0540 1.1066 1.1333 1.6325 2.3879 2.0109 1.4360 1.4704 2.5821 7.6310 6.2844 2.4843 2.2938 6.7136 2.5887 2.3999 3.4913 3.0310 4.3414 6.0947 5.2507 6.0318 6.2359 1.0879 1.0845 1.0867 1.0882 1.0932 1.0930 1.0960 1.0915 1.0985 1.0999 1.0957 1.0955 1.1003 1.0746
irintensity: 0.1517 0.0063 0.7079 0.4943 0.4274 0.3468 0.1883 3.0114 1.4406 5.6923 0.8390 2.0894 4.2891 2.3460 0.1212 0.0283 13.9607 1.6847 0.6102 21.6538 16.0662 6.9468 8.1559 1.3005 2.5306 51.6291 8.8641 5.9686 12.9479 65.1945 17.9131 61.3892 19.1002 81.1360 41.9410 27.1167 5.3732 0.3902 8.3186 0.6383 8.1298 2.9446 13.3267 33.1267 0.0179 1.8219 0.9319 2.2574 0.9259 0.2170 41.8925 21.7532 9.0635 55.7299 6.5592 6.1596 51.4193 31.6155 1.2913 0.0606 5.9419 0.9219 15.2986 138.3990 54.3809 21.2045 3.1024 11.6517 3.1855 7.6874 32.9745 12.3478 6.4458 51.7366 115.3193 10.9528 276.5963 148.3183 3.5344 7.3818 8.1716 199.2387 14.0666 2.5909 1.3575 6.9763 29.4188 29.2415 29.1806 3.8087 40.8323 19.3583 3.7464 4.3898 0.6641 7.4357
temp: 298.150 k
press: 1.00000 atm
elementType: 16 7 7 6 6 6 6 6 6 6 6 6 6 6 6 6 6 6 6 6 1 1 1 1 1 1 1 1 1 1 1 1 1 1
symmnumber: 1
zpe: 687436.0 jmol-1
zpe.correction: 0.261831 hartree
zpe.thermalcorrener: 0.278667 hartree
zpe.thermalcorrenthalpy: 0.279611 hartree
zpe.thermalcorrgfe: 0.214988 hartree
zpe.sumelectzpe: -1162.356165 hartree
zpe.sumelectthermal: -1162.339329 hartree
zpe.sumelectthermalent: -1162.338384 hartree
zpe.sumelectthermalfe: -1162.403008 hartree
dipole: -0.1263 2.4804 0.4401
dipole: 2.5223
quadrupole: -114.5357 -104.2970 -129.2231
quadrupole: 0.3013 -0.7969 3.1106
quadrupole: 1.4829 11.7216 -13.2045 0.3013 -0.7969 3.1106
hfenergy: -1162.6179956 hartree
pointgroup: C01 [X(C17H14N2S1)]
dipole: 0.0024468 -0.9819272 -0.1433283 debye
polarizability: 373.0045909|3.4913768|260.8738731|-15.2365792|4.9875262|111.615026 unknown
InChI: InChI=1S/C17H14N2S/c1-3-8-14(9-4-1)17(16-12-7-13-20-16)19-18-15-10-5-2-6-11-15/h1-13,18H
charge 0 multiplicity 1
34 atoms
S  -2.189063 -2.326771 1.300886
N  0.304399 0.403725 -0.076003
N  1.388556 -0.422137 -0.059354
C  -0.933543 -0.102535 -0.032798
C  -2.049199 0.87699 0.025529
C  -1.201455 -1.557931 -0.02782
C  -3.368476 0.504649 -0.355267
C  -1.816179 2.216662 0.450429
C  2.698286 0.103173 -0.095355
C  -0.731115 -2.544534 -0.896387
C  -4.421611 1.443891 -0.314102
C  -2.868095 3.152032 0.485982
C  -4.178821 2.771518 0.105778
C  -1.137942 -3.884696 -0.555504
C  3.792512 -0.797705 0.009914
C  2.938123 1.495187 -0.244878
C  -1.917062 -3.946393 0.589117
C  5.113612 -0.306641 -0.034256
C  4.265022 1.968787 -0.285413
C  5.361278 1.078615 -0.18141
H  -3.565502 -0.516345 -0.699213
H  -0.803038 2.500777 0.750926
H  -0.149511 -2.303983 -1.791318
H  1.263574 -1.441617 0.030914
H  -5.430695 1.14021 -0.614974
H  -2.671706 4.177576 0.818934
H  -4.997573 3.498876 0.140194
H  -0.870391 -4.764623 -1.145223
H  3.608615 -1.873151 0.130109
H  2.08584 2.173614 -0.33003
H  -2.362522 -4.816762 1.068304
H  5.950886 -1.008739 0.048811
H  4.444985 3.043696 -0.401675
H  6.388312 1.456787 -0.214644
