program: Gaussian 09
title: 000286969
version: EM64L-G09RevD.01
frameworkgroup: C1[X(C20H18N4)]
method: RPBEPBE
basis: SDD
operation: Freq
keyword: #pfreq=noraman
keyword: PBEPBE/SDD
title: #p freq=noraman PBEPBE/SDD
converged: YES YES NO NO
title: Mulliken charges:
elementType: N N N N C C C C C C C C C C C C C C C C C C C C H H H H H H H H H H H H H H H H H H
charge: -0.436490 -0.054715 -0.448928 -0.079293 0.340870 0.021872 -0.379660 -0.369750 0.440422 0.486155 -0.235731 -0.228591 -0.307423 -0.243808 -0.402575 -0.365006 -0.421373 -0.348622 -0.196129 -0.191248 -0.262193 -0.190484 -0.196235 -0.266785 0.220345 0.260442 0.223177 0.225153 0.218948 0.369252 0.227907 0.222948 0.271619 0.218995 0.237871 0.281512 0.222784 0.223687 0.227225 0.226005 0.227248 0.230600
chargesum: 0.00000
title: Mulliken charges with hydrogens summed into heavy atoms:
elementType: N N N N C C C C C C C C C C C C C C C C C C C C
charge: -0.067238 -0.054715 -0.167415 -0.079293 0.340870 0.021872 -0.159315 -0.109307 0.440422 0.486155 -0.012554 -0.003438 -0.088474 -0.015901 -0.179627 -0.093387 -0.202378 -0.110751 0.026656 0.032439 -0.034968 0.035521 0.031013 -0.036185
polarizability: 4.42365069e+02 -6.34557471e+00 3.92115264e+02 -2.99350262e-01 1.59538630e+00 1.04008395e+02
1716.lowfreq: -5.8826 -0.0006 -0.0001 0.0000 2.4566 4.0831 27.5364 33.6858 36.6156
frequency: 27.4911 33.6739 36.6026 43.1270 46.4527 58.2836 78.3340 118.2227 124.0524 182.1631 208.8207 223.7341 234.2299 255.0494 265.3076 277.1231 335.7108 349.5607 405.3147 407.2599 407.9766 422.5526 474.6461 498.9072 504.7551 516.2177 524.4354 549.2245 607.8872 612.7184 614.8134 615.3971 632.9322 642.7983 667.3606 692.4558 693.7198 699.8202 758.7608 763.4620 771.6166 811.4489 823.9275 830.2853 840.4643 848.9984 864.7948 889.6330 891.0982 905.6700 920.1049 944.4934 962.8909 968.4447 975.2151 981.0013 982.3466 985.0353 987.8931 989.9185 994.6461 1011.1988 1020.1007 1020.7590 1037.4355 1078.5173 1082.1020 1085.5202 1133.6479 1168.5854 1171.2630 1171.6726 1175.4515 1180.6969 1185.8702 1193.4172 1266.9193 1280.5519 1290.3379 1309.5691 1316.0904 1320.7446 1353.6791 1378.6300 1386.6387 1395.5582 1425.8388 1440.6147 1443.1997 1461.5136 1482.2949 1483.8475 1487.0962 1519.1678 1527.9765 1556.0856 1583.8189 1595.7890 1601.4415 1611.0805 1611.5351 1616.3824 3021.5158 3114.5813 3117.5158 3119.9644 3123.8345 3128.6604 3130.3399 3133.0328 3141.6370 3142.5812 3144.4838 3156.6176 3163.3312 3165.4259 3168.4958 3178.5457 3181.5063 3412.2484
redmass: 4.3208 5.3214 4.0089 3.8445 4.3519 5.0905 5.4367 5.2434 4.9166 5.0791 4.9337 3.8508 5.0830 4.9511 4.9541 4.5708 4.7471 5.5681 2.9126 2.9025 2.9144 5.9125 4.3080 4.3636 3.3871 3.0528 4.9321 1.2693 6.0129 6.4480 6.4769 6.2213 5.0412 5.8624 6.5179 1.8864 1.8827 1.7471 1.7530 1.7471 1.9127 5.4261 1.2612 1.2478 4.1851 1.2761 1.2236 1.4767 1.4460 1.4486 1.4605 5.3303 1.3784 1.3677 1.4124 4.0291 4.5139 1.5438 4.8240 1.3554 1.3267 3.7516 2.2278 2.1454 2.0660 1.7304 1.6034 1.5593 4.0357 1.0748 1.0533 1.0546 1.1470 1.1441 1.9898 1.4137 2.7185 2.1036 1.8610 1.6910 1.3793 1.4465 1.7961 7.1417 7.3318 5.3167 2.8634 2.3072 2.4425 3.3417 2.2045 2.4602 2.7095 2.1070 4.9194 1.9732 6.0644 4.8492 3.9235 6.1388 5.9086 6.1753 1.0879 1.0880 1.0870 1.0847 1.0822 1.0874 1.0870 1.0866 1.0933 1.0935 1.0931 1.0961 1.0986 1.0969 1.0994 1.0970 1.0957 1.0751
irintensity: 0.3501 0.0897 0.4069 0.2043 0.4636 0.1481 1.3730 1.0664 1.1423 2.9392 2.6859 5.8014 2.0181 1.1125 3.1284 6.4319 11.0584 4.3948 0.0897 0.1713 0.0642 4.7172 3.5379 7.1092 22.0862 21.8788 7.5009 61.2192 12.1949 0.1439 1.7349 0.2286 4.8557 19.0105 24.5412 37.1069 42.0693 51.8195 65.4185 92.8955 42.8217 10.0682 3.9059 13.4131 8.1312 2.9745 48.9485 35.0044 19.7504 11.8654 4.6954 44.4737 0.0014 0.1244 1.4656 3.5971 2.3258 1.7043 1.1244 1.2476 1.2209 20.6633 23.8861 2.7856 3.6375 36.7266 7.1380 6.3765 181.7303 0.2666 1.4872 0.0782 1.4755 7.5791 15.5277 4.6104 148.9101 111.4167 69.5541 45.0873 21.5921 4.1620 3.0855 9.2110 6.1776 9.3714 101.6331 1.3008 5.9156 110.2684 108.8388 69.9261 25.3939 154.5133 105.3609 173.9729 10.0665 3.0808 15.4476 86.4200 101.4903 119.8970 46.6777 11.8632 10.5737 11.0631 49.0654 2.2079 0.9409 0.7039 37.2009 32.4861 24.3045 34.2274 38.8092 40.7405 17.7751 5.0954 5.1496 2.2336
temp: 298.150 k
press: 1.00000 atm
elementType: 7 7 7 7 6 6 6 6 6 6 6 6 6 6 6 6 6 6 6 6 6 6 6 6 1 1 1 1 1 1 1 1 1 1 1 1 1 1 1 1 1 1
symmnumber: 1
zpe: 873203.6 jmol-1
zpe.correction: 0.332586 hartree
zpe.thermalcorrener: 0.352707 hartree
zpe.thermalcorrenthalpy: 0.353651 hartree
zpe.thermalcorrgfe: 0.281379 hartree
zpe.sumelectzpe: -990.225427 hartree
zpe.sumelectthermal: -990.205305 hartree
zpe.sumelectthermalent: -990.204361 hartree
zpe.sumelectthermalfe: -990.276633 hartree
dipole: -1.7296 -2.7369 -0.5192
dipole: 3.2789
quadrupole: -125.1949 -117.7066 -150.1498
quadrupole: 0.6765 -0.0567 1.5162
quadrupole: 5.8222 13.3105 -19.1327 0.6765 -0.0567 1.5162
hfenergy: -990.5580122 hartree
pointgroup: C01 [X(C20H18N4)]
dipole: -1.2295736 0.150293 0.3601972 debye
polarizability: 403.731242|27.9485105|422.4894415|-30.3380112|37.6921578|112.268045 unknown
InChI: InChI=1S/C20H18N4/c1-4-10-17(11-5-1)20(24-23-19-14-8-3-9-15-19)16-21-22-18-12-6-2-7-13-18/h1-16,22-23H
charge 0 multiplicity 1
42 atoms
N  1.05686 -0.560295 -0.181121
N  1.464173 0.733536 -0.091248
N  -2.761509 0.087272 0.517353
N  -1.431441 0.236254 0.221133
C  1.05664 3.079716 0.249072
C  0.537804 1.685258 0.152933
C  0.230938 4.206261 -0.023635
C  2.41374 3.312548 0.610108
C  1.994325 -1.588204 -0.41003
C  -3.438367 -1.131958 0.314044
C  0.741054 5.519703 0.075033
C  2.922959 4.622976 0.701977
C  -0.882178 1.446405 0.365355
C  2.088624 5.736901 0.440795
C  1.537282 -2.934492 -0.393301
C  3.364453 -1.307773 -0.660564
C  -4.776779 -1.24971 0.780156
C  -2.823971 -2.228971 -0.347695
C  2.444112 -3.987169 -0.631288
C  4.258241 -2.371707 -0.894307
C  3.809928 -3.715234 -0.8832
C  -5.485634 -2.452548 0.589215
C  -3.54602 -3.426852 -0.5259
C  -4.876439 -3.552129 -0.060864
H  -0.805363 4.064915 -0.352202
H  3.05272 2.448615 0.816472
H  0.088624 6.372049 -0.1465
H  3.970249 4.77858 0.985157
H  -1.493852 2.30169 0.703188
H  0.036985 -0.760171 -0.07143
H  2.484072 6.755808 0.517197
H  0.482719 -3.151701 -0.18144
H  3.696302 -0.266611 -0.673094
H  -5.255048 -0.405563 1.293575
H  -1.807086 -2.127411 -0.735257
H  -3.290279 0.883716 0.899156
H  2.084221 -5.0221 -0.614759
H  5.313885 -2.151227 -1.090176
H  4.512241 -4.53524 -1.06653
H  -6.516039 -2.531928 0.953131
H  -3.066994 -4.266977 -1.04144
H  -5.429452 -4.485637 -0.205968
