program: Gaussian 09
title: 000286936
version: EM64L-G09RevD.01
frameworkgroup: C1[X(C14H13NO5S)]
method: RPBEPBE
basis: SDD
operation: Freq
keyword: #p
keyword: freq=noraman
keyword: PBEPBE/SDD
title: #p freq=noraman PBEPBE/SDD
converged: YES YES NO NO
title: Mulliken charges:
elementType: S O O O O O N C C C C C C C C C C C C C C H H H H H H H H H H H H H
charge: 0.949129 -0.380489 -0.497322 -0.492952 -0.195166 -0.187979 0.024768 0.502391 -0.023903 -0.533811 0.302892 -0.363747 -0.363556 -0.314026 -0.330402 -0.362045 -0.238105 0.407944 -0.665205 -0.166298 -0.348047 0.215281 0.216140 0.240501 0.240074 0.255388 0.256145 0.330989 0.294341 0.222901 0.225978 0.227260 0.255220 0.295712
chargesum: 0.00000
title: Mulliken charges with hydrogens summed into heavy atoms:
elementType: S O O O O O N C C C C C C C C C C C C C C
charge: 0.949129 -0.380489 -0.497322 -0.492952 -0.195166 -0.187979 0.024768 0.502391 -0.023903 -0.102390 0.302892 -0.123246 -0.123482 -0.058638 -0.074257 -0.031056 0.056236 0.407944 0.010934 0.088922 -0.052335
polarizability: 4.12480872e+02 -2.60261851e+01 2.10017413e+02 9.51057607e+00 1.44621106e+01 1.33457225e+02
1716.lowfreq: -7.9210 -2.4005 -0.0011 -0.0009 -0.0006 4.3757 7.8777 12.2462 25.3106
frequency: -5.1149 12.0415 25.2948 27.3362 42.4935 51.7882 63.1276 102.8284 106.3448 150.6841 157.4027 178.2650 186.7645 207.5235 218.2826 236.3523 278.2596 322.5306 334.6337 372.3999 393.1859 400.7655 402.9929 424.8332 428.4787 451.0898 464.4974 514.0190 518.4866 573.8099 627.6186 635.9676 667.7803 686.2520 702.5517 709.4255 751.5686 788.5213 798.7996 816.1846 819.8249 825.4376 830.5276 859.2371 932.3477 941.1536 960.4529 966.1675 966.5897 976.6787 980.3161 1000.5784 1008.5661 1043.6406 1052.7445 1053.5042 1081.1594 1098.4708 1118.3074 1153.2402 1170.7800 1209.3728 1213.2509 1220.5704 1238.9265 1268.9398 1296.1738 1306.4216 1372.9912 1376.3856 1389.3801 1402.7916 1420.7945 1424.7005 1446.6644 1469.2141 1471.3462 1478.6469 1490.5235 1547.0657 1585.2783 1598.1044 1600.3868 2984.2353 2992.0117 3044.6516 3084.8833 3089.1198 3129.4779 3132.1508 3157.2448 3166.6308 3170.3214 3171.9896 3175.7463 3189.4240
redmass: 2.5876 7.3331 5.9309 4.3315 6.0636 7.4445 7.5647 7.3119 9.6192 6.6573 6.3999 4.8631 5.4106 1.4760 3.6018 8.5464 5.8913 3.0494 4.9996 9.9504 8.3036 7.6581 2.9939 4.1033 3.6344 5.8295 5.4140 6.9500 6.6227 2.5126 6.8517 7.2536 3.5183 8.7812 3.9026 4.2024 3.3823 1.1591 10.5132 7.6928 1.5023 5.9630 1.2514 1.7759 14.7590 1.4207 1.4009 1.8183 1.6872 1.3740 5.9552 2.6553 1.3649 1.4510 1.9893 2.0357 1.9395 2.4617 1.2724 1.6364 1.1290 1.8114 9.6390 3.0385 1.2563 1.3186 1.3569 1.4884 3.7061 8.4824 1.1929 8.9380 3.7622 3.0401 2.3588 1.6190 1.0452 1.3296 1.1079 6.4521 6.9501 6.0466 7.6546 1.0347 1.0597 1.1021 1.1004 1.1015 1.0895 1.0895 1.0886 1.0953 1.0964 1.0940 1.0930 1.0977
irintensity: 0.0650 1.1053 2.8352 0.1493 0.3194 1.1026 0.3922 17.5080 6.8835 1.5583 5.3146 13.4895 4.3970 0.0671 0.5619 16.9376 42.3559 1.8888 3.7680 17.4039 11.7270 37.2685 1.3209 4.6175 13.7860 93.7487 19.4828 3.9264 36.3058 13.9182 0.5486 7.4651 11.4126 16.4512 24.4651 4.3357 0.7801 2.5100 29.3389 61.7339 14.0491 14.2690 0.2243 70.1999 56.5868 8.4376 6.0840 9.7530 0.3604 0.0918 6.4062 2.9973 1.0972 5.1562 39.8955 54.4944 40.9500 17.5077 8.1388 77.2830 27.2940 3.2954 261.5548 9.7665 0.0325 0.4100 0.0517 1.5277 0.1807 71.2377 9.5615 3.8581 5.9458 62.9612 28.0896 0.8073 16.0955 11.8244 5.5488 0.2065 10.4145 175.0995 1.9436 42.7170 41.1352 6.9707 59.9832 35.4641 13.3115 26.1797 3.9232 6.8072 4.1887 8.5186 15.5130 2.4594
temp: 298.150 k
press: 1.00000 atm
elementType: 16 8 8 8 8 8 7 6 6 6 6 6 6 6 6 6 6 6 6 6 6 1 1 1 1 1 1 1 1 1 1 1 1 1
symmnumber: 1
zpe: 639922.7 jmol-1
zpe.correction: 0.243734 hartree
zpe.thermalcorrener: 0.263523 hartree
zpe.thermalcorrenthalpy: 0.264467 hartree
zpe.thermalcorrgfe: 0.191643 hartree
zpe.sumelectzpe: -1368.448375 hartree
zpe.sumelectthermal: -1368.428586 hartree
zpe.sumelectthermalent: -1368.427641 hartree
zpe.sumelectthermalfe: -1368.500465 hartree
dipole: -3.0344 -2.1890 -3.1993
dipole: 4.9228
quadrupole: -107.1116 -132.5646 -137.5458
quadrupole: -25.0734 -1.5686 7.6562
quadrupole: 18.6290 -6.8239 -11.8051 -25.0734 -1.5686 7.6562
hfenergy: -1368.6921085 hartree
pointgroup: C01 [X(C14H13N1O5S1)]
dipole: -1.2202782 -1.1376778 -0.9837555 debye
polarizability: 412.9614509|-23.5091558|212.4263472|8.7519903|-4.6877846|130.5677118 unknown
InChI: InChI=1S/C8H9O.C6H4NO4S/c1-2-7-3-5-8(9)6-4-7;8-7(9)5-2-1-3-6(4-5)12(10)11/h3-6H,2H2,1H3;1-4H
charge 0 multiplicity 1
34 atoms
S  0.249254 -0.842544 1.203232
O  -0.714722 -0.572625 -0.599604
O  -0.023175 -2.321409 1.830726
O  0.062984 0.497034 2.111569
O  5.800476 1.589194 -1.032744
O  4.013588 2.735937 -0.196062
N  4.617144 1.645524 -0.523161
C  -4.812614 0.437871 -0.53969
C  1.976368 -0.836387 0.451502
C  -6.287278 0.798892 -0.503887
C  -2.050082 -0.247123 -0.524915
C  -3.815115 1.444201 -0.397931
C  -4.399531 -0.919892 -0.664774
C  -2.449051 1.115666 -0.380268
C  -3.039063 -1.269125 -0.64501
C  2.605136 0.400017 0.261282
C  2.554618 -2.073026 0.11865
C  3.898947 0.359247 -0.298769
C  -6.852275 0.796775 0.945078
C  3.854028 -2.068081 -0.440335
C  4.533388 -0.850658 -0.65592
H  -6.867296 0.082132 -1.115343
H  -6.44156 1.801344 -0.946041
H  -4.122333 2.492248 -0.301289
H  -5.159484 -1.702216 -0.77716
H  -1.675754 1.882351 -0.268853
H  -2.710584 -2.309403 -0.737362
H  2.138826 1.349026 0.541547
H  2.010389 -3.003965 0.30694
H  -7.924176 1.064984 0.943072
H  -6.746059 -0.19947 1.410579
H  -6.31516 1.523576 1.580286
H  4.332956 -3.014558 -0.707677
H  5.537407 -0.819241 -1.087069
