program: Gaussian 09
title: 000286941
version: EM64L-G09RevD.01
frameworkgroup: C1[X(C19H17O2P)]
method: RPBEPBE
basis: SDD
operation: Freq
keyword: #p
keyword: freq=noraman
keyword: PBEPBE/SDD
title: #p freq=noraman PBEPBE/SDD
converged: YES YES NO NO
title: Mulliken charges:
elementType: P O O C C C C C C C C C C C C C C C C C C C H H H H H H H H H H H H H H H H H
charge: 1.078633 -0.550351 -0.623104 -0.108781 -0.112522 0.249866 -0.302631 -0.234046 -0.232943 -0.296265 0.314030 -0.345754 -0.207752 -0.224155 -0.225572 -0.206288 -0.386576 -0.221797 -0.222835 -0.788417 -0.222508 -0.244799 0.281826 0.234150 0.248813 0.285815 0.292195 0.236142 0.234559 0.234335 0.235884 0.230218 0.234122 0.234253 0.214258 0.245355 0.219820 0.227966 0.224856
chargesum: 0.00000
title: Mulliken charges with hydrogens summed into heavy atoms:
elementType: P O O C C C C C C C C C C C C C C C C C C C
charge: 1.078633 -0.550351 -0.623104 -0.108781 -0.112522 0.249866 -0.020806 0.000104 0.015870 -0.010450 0.314030 -0.053560 0.028390 0.010403 0.008763 0.029597 -0.156358 0.012325 0.011419 -0.108984 0.005458 -0.019943
polarizability: 2.63428437e+02 1.94786113e+01 2.01439777e+02 3.96026297e+00 -2.56277763e+01 2.12881831e+02
1716.lowfreq: -10.6171 -8.3767 -2.6676 -0.0006 0.0005 0.0007 12.2391 17.5141 23.8720
frequency: 10.6898 17.4325 23.7930 34.7962 44.2882 57.8562 107.7029 126.9747 132.0426 160.2839 174.6126 193.2102 212.3531 224.4508 233.7941 277.7487 291.2793 357.4041 384.4392 395.4728 398.8315 438.3272 442.4005 450.8636 475.6868 518.2209 522.6002 541.6835 583.0154 610.7601 611.3745 642.4518 679.4065 698.1267 704.2928 705.4245 717.8378 758.2519 762.3849 766.6224 767.5855 841.0807 857.3041 863.2994 867.3881 933.1088 939.7380 942.9246 980.6277 981.7181 983.6643 986.0865 986.6132 986.7538 998.6078 1005.2272 1005.8778 1020.9384 1023.0458 1044.8548 1045.4876 1076.8700 1083.5140 1090.1825 1098.2968 1105.8335 1168.7964 1174.6130 1175.3664 1177.4928 1187.5507 1192.0679 1233.8670 1286.1833 1309.1300 1314.5143 1376.5331 1379.8169 1382.6747 1396.5648 1426.1039 1427.0083 1429.3985 1459.5815 1464.7781 1467.4659 1474.9074 1483.7882 1587.2388 1590.6496 1593.1205 1595.6810 1597.6845 1607.5991 2973.6675 3050.8516 3088.8087 3121.0698 3129.2056 3130.7884 3134.1909 3136.0579 3140.2403 3144.8338 3147.8299 3149.9908 3155.4417 3161.2076 3164.3165 3168.4910 3171.3827
redmass: 3.6617 3.9452 5.6180 4.0639 5.2841 4.9590 3.7417 1.2966 3.3570 4.8511 4.3616 5.2467 5.1620 4.9419 4.7298 6.8258 5.4998 4.0544 7.8132 2.7981 2.8269 3.1495 4.4352 4.6390 6.0103 4.4669 5.5149 3.9034 7.1150 6.4664 6.4838 8.4791 6.7864 2.2437 1.9710 4.0294 3.0383 1.9258 1.3476 3.6070 1.6649 5.5277 1.2521 1.2461 1.3114 1.3749 1.3814 1.3694 1.3193 1.6207 1.4301 5.1986 1.6123 4.0153 8.7855 1.3316 1.3349 2.9143 2.8614 2.1134 1.5284 1.6092 1.7377 2.6719 2.8971 2.1803 1.5126 1.0568 1.0550 1.3802 1.1326 1.1489 2.7791 1.4314 1.3258 1.3085 6.5377 8.6213 9.0501 1.2825 2.1097 1.9705 2.1229 1.0542 2.0329 2.0342 1.2288 2.3834 6.1111 6.1689 6.4065 5.8635 5.8562 6.6353 1.0381 1.0950 1.0997 1.0869 1.0851 1.0853 1.0890 1.0879 1.0885 1.0924 1.0945 1.0929 1.0967 1.0964 1.1009 1.1017 1.1011
irintensity: 0.0311 0.0447 0.5916 0.0827 0.7941 0.6110 1.2516 0.5663 0.8807 2.3096 0.5314 3.5005 2.5381 8.1046 11.8145 5.1388 1.2722 3.1959 5.8877 0.0774 0.3259 1.0535 18.8982 19.5815 17.2894 97.2533 98.1661 18.3160 22.3436 0.3387 0.6616 50.2186 27.1354 5.3546 99.3404 62.9876 4.1953 58.8734 110.2343 50.9164 15.6721 123.8518 0.3066 0.4881 4.3681 0.1108 2.5302 3.1186 0.7981 3.9600 0.8291 13.3712 1.0425 1.8379 55.1129 0.3064 0.3957 3.0221 6.3412 22.4965 7.1276 3.0714 12.7302 49.3373 46.8698 86.8746 69.1388 0.3106 0.0794 68.6254 8.5734 0.2710 74.7698 0.3575 0.7055 6.0055 0.6362 0.6963 1.1387 11.9912 1.0394 37.5739 28.5621 9.6793 10.4822 10.2210 16.5855 105.2603 0.1395 0.9708 20.2518 0.5479 0.5551 27.8291 31.6313 28.1053 28.9262 7.4740 0.2209 0.2751 13.8804 3.4553 5.9492 7.6005 8.8271 8.0969 15.8277 25.0217 30.1865 30.9268 20.6581
temp: 298.150 k
press: 1.00000 atm
elementType: 15 8 8 6 6 6 6 6 6 6 6 6 6 6 6 6 6 6 6 6 6 6 1 1 1 1 1 1 1 1 1 1 1 1 1 1 1 1 1
symmnumber: 1
zpe: 796320.4 jmol-1
zpe.correction: 0.303302 hartree
zpe.thermalcorrener: 0.323471 hartree
zpe.thermalcorrenthalpy: 0.324415 hartree
zpe.thermalcorrgfe: 0.250535 hartree
zpe.sumelectzpe: -1224.351795 hartree
zpe.sumelectthermal: -1224.331626 hartree
zpe.sumelectthermalent: -1224.330682 hartree
zpe.sumelectthermalfe: -1224.404562 hartree
dipole: -1.3749 1.5390 4.1026
dipole: 4.5924
quadrupole: -119.3132 -126.6657 -133.2391
quadrupole: 5.4065 0.4093 -5.4319
quadrupole: 7.0928 -0.2596 -6.8331 5.4065 0.4093 -5.4319
hfenergy: -1224.6550975 hartree
pointgroup: C01 [X(C19H17O2P1)]
dipole: 0.6615495 0.4696152 -1.6144156 debye
polarizability: 259.200907|-24.8874501|207.7408025|9.5628018|24.411009|210.8083354 unknown
InChI: InChI=1S/C19H17O2P/c1-16-10-8-9-15-19(16)21-22(20,17-11-4-2-5-12-17)18-13-6-3-7-14-18/h2-15H,1H3
charge 0 multiplicity 1
39 atoms
P  0.608903 0.068821 0.969071
O  -0.504805 -1.080151 0.207986
O  0.481209 0.346474 2.543681
C  2.182389 -0.791648 0.500468
C  0.330491 1.623932 -0.019821
C  -1.91802 -0.961805 0.294044
C  3.239409 -0.745143 1.438994
C  0.151055 1.595501 -1.422403
C  2.335631 -1.464627 -0.733759
C  0.313667 2.847556 0.688821
C  -2.647258 -1.589435 -0.75269
C  -2.560049 -0.306338 1.368841
C  4.469136 -1.36832 1.130067
C  -0.043657 2.806922 -2.121418
C  3.567652 -2.086539 -1.033907
C  0.118994 4.055724 -0.017348
C  -4.060064 -1.527229 -0.688394
C  4.635123 -2.033992 -0.10661
C  -0.056093 4.036147 -1.420586
C  -1.923543 -2.297813 -1.879664
C  -3.971474 -0.254963 1.396683
C  -4.725349 -0.864608 0.369518
H  3.084882 -0.24307 2.400683
H  0.140817 0.642381 -1.962857
H  1.497116 -1.530824 -1.433997
H  0.438691 2.836574 1.777442
H  -1.964374 0.137254 2.1739
H  5.291234 -1.338148 1.853047
H  -0.189534 2.792447 -3.206877
H  3.692594 -2.615549 -1.984839
H  0.101404 5.007042 0.525234
H  -4.643354 -2.006649 -1.484026
H  5.58953 -2.517219 -0.343761
H  -0.207952 4.97433 -1.965916
H  -1.280666 -1.597154 -2.447204
H  -1.25912 -3.090739 -1.49062
H  -2.639482 -2.754029 -2.5844
H  -4.474846 0.25237 2.226932
H  -5.819884 -0.830887 0.392586
