program: Gaussian 09
title: 000286961
version: EM64L-G09RevD.01
frameworkgroup: C1[X(C21H30O3)]
method: RPBEPBE
basis: SDD
operation: Freq
keyword: #pfreq=noraman
keyword: PBEPBE/SDD
title: #p freq=noraman PBEPBE/SDD
converged: YES YES NO NO
title: Mulliken charges:
elementType: O O O C C C C C C C C C C C C C C C C C C C C C H H H H H H H H H H H H H H H H H H H H H H H H H H H H H H
charge: -0.426239 -0.221582 -0.279035 -0.155998 0.184658 0.260342 -0.473448 -0.538999 -0.459385 -0.451376 0.377603 -0.611296 -0.790855 0.325138 -0.782092 0.062795 -0.575965 -0.699724 0.432329 0.124135 -0.204620 -0.716634 -0.715743 -0.541271 0.245982 0.218153 0.206538 0.226493 0.224708 0.224483 0.199639 0.237961 0.199619 0.224453 0.218908 0.247958 0.230090 0.211874 0.242477 0.228042 0.227542 0.232591 0.239439 0.376768 0.202650 0.246099 0.203829 0.216001 0.215426 0.203815 0.245858 0.218934 0.241633 0.219299
chargesum: 0.00000
title: Mulliken charges with hydrogens summed into heavy atoms:
elementType: O O O C C C C C C C C C C C C C C C C C C C C C
charge: -0.049471 -0.221582 -0.279035 0.089984 0.184658 0.260342 -0.048757 -0.087799 -0.035262 -0.013796 0.377603 -0.167935 -0.100933 0.325138 -0.084032 0.062795 -0.343374 -0.460285 0.432329 0.124135 -0.001970 -0.050705 -0.050644 0.138595
polarizability: 2.98939222e+02 9.85094456e-01 2.28336484e+02 2.94770726e+00 -7.86932826e-01 1.75655377e+02
1716.lowfreq: -17.4213 -3.0686 -0.0002 0.0006 0.0008 6.4040 36.5684 38.4469 73.9046
frequency: 36.2673 37.3018 73.8882 81.4541 88.5483 95.8089 110.0109 128.2541 146.1735 166.3924 169.9431 196.9343 199.9270 220.0573 222.9703 234.9630 237.4390 244.9576 252.0950 268.3917 282.6634 296.4832 298.0038 300.4398 317.0194 342.1474 344.6292 357.6967 382.2702 409.2628 420.2683 453.7419 457.5691 468.9302 483.9116 493.5875 509.3311 521.4498 574.2609 593.3775 595.9680 632.6022 662.8852 689.6698 693.4983 717.2070 725.0481 736.8724 753.6194 797.7259 825.6289 850.6314 857.6546 867.7040 877.5853 902.7647 906.5910 917.6467 924.6118 947.4669 956.7708 959.9503 976.9773 985.6994 995.5748 1010.0189 1018.7533 1041.6439 1052.7009 1069.4564 1074.6317 1086.7474 1089.3535 1110.7165 1116.8873 1122.3297 1134.8786 1151.0241 1159.5448 1169.8593 1178.6918 1191.0923 1200.4441 1211.4997 1216.2996 1226.9632 1244.8171 1261.0306 1268.4369 1279.4477 1294.0265 1303.9751 1308.3179 1312.4600 1320.3680 1335.3994 1335.9526 1342.5539 1348.1778 1358.6546 1369.4305 1384.9969 1386.2120 1390.7527 1393.5272 1407.1788 1437.4520 1455.0860 1459.5691 1459.9151 1462.9875 1465.8815 1466.9244 1471.2110 1473.2949 1475.3262 1479.2507 1479.7280 1484.3227 1489.8336 1492.4197 1497.1569 1505.9391 1579.6912 1614.9343 1636.0454 2950.1683 2954.0027 2966.0530 2973.6945 2976.6199 2980.2354 2980.8754 2982.5431 2986.0488 2991.4765 2992.9731 2995.9593 3018.2188 3030.4108 3039.5839 3043.2412 3056.5370 3060.4393 3065.2920 3069.8009 3078.0904 3083.7061 3092.5167 3096.3180 3096.8673 3100.2051 3101.3438 3116.3147 3150.9572 3510.6836
redmass: 3.7030 4.0158 2.9849 10.5900 3.3211 3.4566 4.1761 3.1248 3.0650 3.3270 3.0115 2.1042 1.6268 1.5604 1.6256 1.6095 2.4939 1.2124 1.6060 1.3153 2.5896 1.8410 2.7023 2.5836 2.5702 3.3402 3.2187 2.4014 3.4998 3.6240 2.9313 3.0515 3.1256 3.2873 3.3753 3.1038 3.2708 3.8041 2.2136 1.8198 2.2111 3.3238 3.1072 4.6958 4.0906 3.8387 5.0339 3.3865 2.8085 2.7205 1.9038 1.9426 1.8010 1.8689 2.4465 1.7399 1.6588 1.9684 1.2310 2.7813 1.4728 2.1234 1.8369 2.0989 2.1200 2.4277 2.5031 2.0705 2.3796 2.0514 1.9256 1.7926 2.0035 1.2699 2.5669 2.3314 1.8741 1.5813 1.5561 2.0851 2.3997 1.8840 1.6911 2.1133 1.8789 1.5825 1.8136 2.9920 1.6263 1.3568 1.4604 1.6804 1.3099 1.4578 1.6842 1.5082 1.4115 1.4560 1.4772 1.5249 1.1940 1.4285 2.3429 1.2250 1.3048 2.8074 1.1959 1.0861 1.1074 1.0857 1.0429 1.0839 1.0512 1.0815 1.0994 1.0510 1.0780 1.0520 1.0810 1.0647 1.1067 1.0818 2.0407 8.1292 6.8099 8.4008 1.0650 1.0331 1.0797 1.0625 1.0358 1.0671 1.0398 1.0607 1.0444 1.0625 1.0522 1.0572 1.0922 1.0985 1.1036 1.0983 1.1002 1.0999 1.0999 1.0991 1.0980 1.0978 1.0982 1.0993 1.0911 1.1014 1.0982 1.0991 1.0880 1.0640
irintensity: 0.4981 0.1639 0.0908 1.1544 4.5294 1.8903 0.0728 0.2497 0.0220 0.5846 1.0468 0.1656 0.6829 0.0432 0.0266 0.6598 0.2303 0.0886 0.1920 0.2984 0.0483 1.4639 0.7206 2.4424 0.8416 2.5842 1.9326 0.5117 1.6093 2.8175 0.4446 3.1460 9.2963 1.3334 2.4311 1.7361 4.3804 5.9694 25.5173 50.3442 69.4808 5.1985 0.1721 0.5417 3.2045 6.5978 6.1093 37.4684 4.8221 0.9530 10.0988 7.1696 19.1029 4.4346 4.8903 6.5609 7.1003 0.8778 7.3138 7.5091 0.2271 26.4034 10.6783 2.4184 3.2783 144.5032 85.8853 7.6110 23.2772 41.5177 41.6363 3.4229 6.0724 0.0580 1.6161 3.1647 10.4929 9.8567 13.1259 0.4176 58.9540 11.1942 16.2990 8.6912 2.6300 23.7055 2.4720 32.7219 7.1238 1.4178 3.9033 24.5038 1.1043 4.2184 8.3491 3.4745 1.0266 2.4132 0.7638 6.6458 19.9207 17.5045 6.5535 11.1757 17.8096 5.9617 3.3319 5.3438 12.8029 6.7681 1.6179 0.5965 12.7495 15.8551 98.6235 1.7596 12.2609 3.5139 23.0779 12.0557 2.4974 8.5214 75.9704 10.2205 18.6535 182.1682 41.3823 59.3328 22.5801 25.9476 43.3856 5.9643 64.6737 5.9572 38.6279 4.4812 55.5569 33.7081 41.0306 32.0320 44.6720 32.9189 36.5301 50.9580 21.7272 78.1071 29.2060 34.7254 36.0195 2.3309 11.7615 18.6283 50.4942 28.1352 11.4263 23.4510
temp: 298.150 k
press: 1.00000 atm
elementType: 8 8 8 6 6 6 6 6 6 6 6 6 6 6 6 6 6 6 6 6 6 6 6 6 1 1 1 1 1 1 1 1 1 1 1 1 1 1 1 1 1 1 1 1 1 1 1 1 1 1 1 1 1 1
symmnumber: 1
zpe: 1220098.7 jmol-1
zpe.correction: 0.464711 hartree
zpe.thermalcorrener: 0.489052 hartree
zpe.thermalcorrenthalpy: 0.489997 hartree
zpe.thermalcorrgfe: 0.413246 hartree
zpe.sumelectzpe: -1042.074042 hartree
zpe.sumelectthermal: -1042.049700 hartree
zpe.sumelectthermalent: -1042.048756 hartree
zpe.sumelectthermalfe: -1042.125506 hartree
dipole: -0.2513 -0.1077 0.0777
dipole: 0.2842
quadrupole: -155.5359 -136.1783 -142.6791
quadrupole: 11.6356 -2.5613 1.5740
quadrupole: -10.7381 8.6195 2.1186 11.6356 -2.5613 1.5740
hfenergy: -1042.5387526 hartree
pointgroup: C01 [X(C21H30O3)]
dipole: 0.098367 -0.0446037 -0.0289707 debye
polarizability: 298.9148804|-1.6520439|228.3473386|2.8953999|-1.2628239|175.6688641 unknown
InChI: InChI=1S/C21H30O3/c1-13(2)15-11-14-7-8-18-20(3,16(14)12-17(15)24-5)9-6-10-21(18,4)19(22)23/h11-13,18,22H,6-10H2,1-5H3
charge 0 multiplicity 1
54 atoms
O  3.967059 -0.204327 -2.177293
O  4.884282 1.39301 -0.78281
O  -3.855506 1.716529 -0.135122
C  1.991448 -0.777901 -0.122028
C  1.029451 0.472276 0.012153
C  3.505193 -0.445245 0.209505
C  1.268199 1.194224 1.384235
C  1.456024 -1.972627 0.708452
C  3.645474 0.315323 1.557092
C  2.743265 1.56216 1.646138
C  -0.463327 0.038507 -0.031215
C  0.11698 -2.45141 0.119847
C  1.291141 1.463298 -1.163481
C  -0.885144 -1.314475 0.015136
C  4.381582 -1.74257 0.261213
C  4.164269 0.375383 -0.9100
C  -1.467622 1.044647 -0.074515
C  -2.273305 -1.607084 -0.011527
C  -3.284005 -0.626762 -0.071993
C  -2.842209 0.730726 -0.095166
C  -4.757228 -1.040585 -0.090484
C  -5.480004 -0.6000 -1.392459
C  -5.522681 -0.550293 1.168968
C  -3.443212 3.118918 -0.155723
H  1.968738 -1.101105 -1.182981
H  0.906534 0.536177 2.199559
H  0.637681 2.103455 1.422485
H  1.319645 -1.689439 1.770334
H  2.169667 -2.813912 0.683701
H  4.703451 0.599692 1.706476
H  3.375694 -0.387478 2.370782
H  3.095847 2.328089 0.931177
H  2.835695 2.010337 2.654547
H  -0.305866 -3.265466 0.739744
H  0.30436 -2.890195 -0.883358
H  2.308789 1.885912 -1.135721
H  1.153071 0.956255 -2.135064
H  0.596074 2.320127 -1.127224
H  4.202656 -2.383829 -0.618597
H  5.454902 -1.47749 0.284065
H  4.166529 -2.316947 1.178204
H  -1.162755 2.095042 -0.087071
H  -2.583176 -2.660706 0.024945
H  4.459385 0.336629 -2.852689
H  -4.767898 -2.150099 -0.069092
H  -5.511486 0.499979 -1.464426
H  -6.518429 -0.98203 -1.399704
H  -4.961992 -0.992513 -2.286646
H  -5.036405 -0.910085 2.09427
H  -6.56212 -0.929506 1.155383
H  -5.553007 0.551728 1.198778
H  -2.872142 3.3879 0.75486
H  -4.380831 3.694286 -0.186174
H  -2.835936 3.35057 -1.052985
