program: Gaussian 09
title: 000286926
version: EM64L-G09RevD.01
frameworkgroup: C1[X(C15H15NO5S)]
method: RPBEPBE
basis: SDD
operation: Freq
keyword: #p
keyword: freq=noraman
keyword: PBEPBE/SDD
title: #p freq=noraman PBEPBE/SDD
converged: NO YES NO NO
title: Mulliken charges:
elementType: S O O O O O N C C C C C C C C C C C C C C C H H H H H H H H H H H H H H H
charge: 0.940527 -0.338824 -0.513636 -0.513564 -0.196333 -0.196337 0.026898 -0.002085 0.391736 0.391360 0.487195 -0.575677 -0.573908 -0.102379 -0.806770 -0.806570 -0.809379 -0.190843 -0.190762 -0.330949 -0.330990 0.395514 0.247216 0.247158 0.218944 0.274026 0.242478 0.273913 0.242512 0.218900 0.232428 0.232348 0.247066 0.287219 0.287155 0.297209 0.297205
chargesum: 0.00000
title: Mulliken charges with hydrogens summed into heavy atoms:
elementType: S O O O O O N C C C C C C C C C C C C C C C
charge: 0.940527 -0.338824 -0.513636 -0.513564 -0.196333 -0.196337 0.026898 -0.002085 0.391736 0.391360 0.487195 -0.328461 -0.326750 -0.102379 -0.071323 -0.071246 -0.097537 0.096376 0.096393 -0.033740 -0.033786 0.395514
polarizability: 4.56523058e+02 1.54687296e-01 2.20921440e+02 3.14851488e+01 -1.26358011e-01 1.51324972e+02
1716.lowfreq: -26.1634 -11.9702 -3.4820 -0.0016 -0.0003 0.0008 5.1401 10.5496 20.1792
frequency: -26.0411 -10.5112 20.1059 22.3886 52.4186 65.1489 72.3680 90.5670 99.4511 112.0021 127.9705 140.9171 144.4147 169.2243 192.6778 216.5104 221.9022 225.0520 257.4795 270.9495 280.4559 334.2771 350.9687 353.3475 381.1370 407.9991 410.0166 453.6552 487.3643 489.3425 505.0521 505.1264 517.5015 560.8994 570.7825 582.6237 612.5671 661.5679 679.7174 733.2259 752.5472 782.2795 783.5862 800.2427 851.0647 866.6843 872.8197 895.2206 905.8150 931.5359 951.9811 990.7746 992.1067 999.2098 1010.8874 1015.1013 1039.2639 1043.1254 1044.4373 1048.9204 1052.5327 1085.6544 1103.4765 1161.1625 1170.4049 1216.1216 1223.9103 1253.8194 1281.0946 1309.6996 1362.1344 1368.8355 1393.2267 1394.1495 1400.9016 1403.0120 1408.3895 1420.1664 1425.4619 1450.9956 1457.9670 1458.2326 1466.6399 1471.0201 1483.9758 1490.7644 1532.3138 1580.9308 1604.5055 1609.6078 2973.1134 2985.2577 2985.6637 3055.6379 3066.1838 3066.4820 3092.0967 3097.5415 3097.8951 3125.4096 3129.5207 3163.3618 3163.6289 3188.0602 3190.1422
redmass: 1.0577 4.2439 7.5175 4.9224 5.1189 7.3656 5.4366 8.0222 6.8811 7.6797 3.4703 1.0404 1.3658 2.8635 10.3238 2.9820 6.6063 8.7622 7.1657 2.5302 2.8197 5.8350 6.6013 12.6133 8.6381 6.2623 2.8712 7.4498 5.9741 3.9176 7.2851 5.1858 3.0901 4.1880 4.1864 2.9572 7.1014 5.0341 8.3962 4.2331 4.1780 6.8012 5.9500 15.8755 1.2413 1.5513 1.2639 1.2939 17.4624 2.5151 3.7080 1.3446 5.5467 1.3765 1.6890 1.5975 1.5993 1.6888 2.3378 1.5295 1.6099 3.9394 1.2771 2.1124 1.2348 8.1016 3.5339 1.4691 1.2455 5.8587 5.0831 6.5367 5.6843 1.2186 1.2859 1.2445 2.4300 6.9576 1.9844 2.1699 1.0600 1.0614 1.1533 1.0660 1.1560 1.3440 5.5139 6.2686 8.4225 5.5257 1.0406 1.0369 1.0369 1.0919 1.0969 1.0969 1.1003 1.1001 1.0999 1.0915 1.0924 1.0905 1.0908 1.0952 1.0965
irintensity: 0.3589 0.2524 0.0837 0.0019 3.7222 0.0897 0.4265 1.6803 34.2533 6.4198 0.0006 2.0359 0.0017 11.6139 12.9432 0.0082 47.7150 0.9509 4.2066 1.4566 0.8968 2.7874 3.9538 37.5650 88.3568 34.6597 0.0022 17.7566 15.7891 0.0197 1.3144 72.8540 0.0315 0.8521 1.6676 7.0005 0.0102 20.9349 31.5055 8.9138 0.7761 34.5624 11.0940 88.4059 0.3480 37.6078 23.4530 0.0479 60.3249 2.7798 1.8385 8.1122 21.5788 0.0389 13.3071 0.6405 24.9111 0.0295 23.8612 0.0011 21.5988 4.9527 12.9530 25.0232 9.2700 413.5249 53.1870 0.0196 0.2398 117.4852 16.0239 58.6804 53.0480 28.7415 29.2475 16.5198 36.2981 41.4271 2.1944 11.4044 30.2395 2.4146 8.2245 15.0057 16.0051 39.2385 28.2704 62.5142 0.7316 225.4351 13.9388 24.6080 1.1855 25.2580 0.0722 14.3645 12.8217 24.8857 18.6219 20.6943 36.2364 0.1966 9.7871 2.6030 0.7756
temp: 298.150 k
press: 1.00000 atm
elementType: 16 8 8 8 8 8 7 6 6 6 6 6 6 6 6 6 6 6 6 6 6 6 1 1 1 1 1 1 1 1 1 1 1 1 1 1 1
symmnumber: 1
zpe: 708057.0 jmol-1
zpe.correction: 0.269685 hartree
zpe.thermalcorrener: 0.290852 hartree
zpe.thermalcorrenthalpy: 0.291797 hartree
zpe.thermalcorrgfe: 0.217921 hartree
zpe.sumelectzpe: -1407.689541 hartree
zpe.sumelectthermal: -1407.668374 hartree
zpe.sumelectthermalent: -1407.667429 hartree
zpe.sumelectthermalfe: -1407.741305 hartree
dipole: -6.0585 -0.0089 -2.2754
dipole: 6.4717
quadrupole: -136.9222 -126.4871 -151.9237
quadrupole: 0.0586 15.4977 -0.0870
quadrupole: 1.5221 11.9572 -13.4794 0.0586 15.4977 -0.0870
hfenergy: -1407.9592259 hartree
pointgroup: C01 [X(C15H15N1O5S1)]
dipole: -2.3902019 0.0001779 0.8774052 debye
polarizability: 456.9758145|-0.0155086|220.9215082|-29.2053853|0.0977351|150.8721474 unknown
InChI: InChI=1S/C9H11O.C6H4NO4S/c1-6-4-7(2)9(10)8(3)5-6;8-7(9)5-1-3-6(4-2-5)12(10)11/h4-5H,1-3H3;1-4H
charge 0 multiplicity 1
37 atoms
S  -0.012768 -0.001972 -1.601446
O  -1.010902 -0.00305 0.300945
O  -0.196579 1.417141 -2.399126
O  -0.193984 -1.420959 -2.399931
O  6.107956 -1.13815 1.186187
O  6.106123 1.143218 1.186506
N  5.560727 0.002129 0.933707
C  -2.369524 -0.001484 0.32427
C  -3.076965 1.257897 0.374964
C  -3.080051 -1.259239 0.37353
C  -5.195441 0.001809 0.592032
C  -4.475008 1.227771 0.523742
C  -4.477932 -1.225889 0.522344
C  1.7090 -0.000699 -0.830656
C  -2.308612 2.557289 0.287774
C  -2.314762 -2.560353 0.285075
C  -6.705146 0.00332 0.703217
C  2.312169 -1.240355 -0.557042
C  2.310171 1.239837 -0.556622
C  3.595698 -1.23956 0.026074
C  3.593695 1.240922 0.026496
C  4.206898 0.001127 0.31135
H  -5.026092 2.174082 0.581866
H  -5.031331 -2.170928 0.579384
H  -2.982287 3.424573 0.385093
H  -1.771591 2.633928 -0.675202
H  -1.541784 2.612938 1.082132
H  -1.777593 -2.637201 -0.677787
H  -1.548284 -2.618724 1.079578
H  -2.990522 -3.426148 0.381237
H  -7.075818 -0.888263 1.237962
H  -7.075251 0.903054 1.224366
H  -7.169568 -0.004434 -0.303205
H  1.80042 -2.173219 -0.81243
H  1.796918 2.171962 -0.811707
H  4.122004 -2.167978 0.260906
H  4.118511 2.170109 0.261617
