program: Gaussian 09
title: 000286923
version: EM64L-G09RevD.01
frameworkgroup: C1[X(C15H15NO5S)]
method: RPBEPBE
basis: SDD
operation: Freq
keyword: #p
keyword: freq=noraman
keyword: PBEPBE/SDD
title: #p freq=noraman PBEPBE/SDD
converged: YES YES NO NO
title: Mulliken charges:
elementType: S O O O O O N C C C C C C C C C C C C C C C H H H H H H H H H H H H H H H
charge: 0.964474 -0.368954 -0.473207 -0.510665 -0.196346 -0.175935 0.023053 -0.232900 0.598798 -0.487490 -0.683697 -0.691664 0.285373 -0.462468 -0.202213 -0.366633 -0.180347 0.430053 -0.209828 -0.323955 -0.218740 -0.193426 0.205186 0.293640 0.230152 0.211181 0.225901 0.223197 0.214711 0.222711 0.240276 0.261615 0.232855 0.314518 0.295509 0.254405 0.250858
chargesum: 0.00000
title: Mulliken charges with hydrogens summed into heavy atoms:
elementType: S O O O O O N C C C C C C C C C C C C C C C
charge: 0.964474 -0.368954 -0.473207 -0.510665 -0.196346 -0.175935 0.023053 -0.027714 0.598798 -0.193850 -0.016463 -0.031045 0.285373 -0.222192 -0.202213 -0.105018 0.052508 0.430053 0.104690 -0.028446 0.035665 0.057432
polarizability: 3.95281428e+02 -5.60903662e+00 2.34410504e+02 -6.45545610e+00 3.19565117e+00 1.36375833e+02
1716.lowfreq: -12.5256 -6.5820 -0.0021 -0.0015 -0.0013 3.6588 6.7222 14.7779 22.4297
frequency: -3.6253 14.5306 22.1665 28.3150 39.0096 71.1200 102.8856 109.2789 115.1436 133.6855 150.7107 171.2336 183.1949 205.0026 213.3711 229.0543 244.3112 246.7611 295.4673 303.7497 307.0614 332.9596 374.1841 390.7080 411.1805 424.8609 438.7954 460.6390 468.7801 504.3520 524.5984 538.5102 552.9302 621.5130 641.9910 655.0257 669.6411 686.2342 705.9030 717.8529 786.5508 791.0641 808.2451 820.8579 865.3154 904.8411 912.3373 919.9518 923.9375 926.4419 941.0959 957.3078 984.3269 985.5293 986.5598 989.2189 1010.6639 1033.4109 1071.8353 1075.8929 1091.9336 1112.2216 1138.2340 1141.1191 1154.3386 1174.4672 1179.7122 1209.3513 1227.0439 1251.6320 1285.4043 1304.8540 1334.3404 1379.6300 1380.5945 1381.0591 1396.1462 1400.0573 1420.8829 1425.2114 1440.4789 1458.1666 1466.1866 1468.2365 1480.2192 1487.0955 1564.1064 1576.7404 1586.7775 1588.3743 2977.1818 2979.3346 2981.9333 3072.3782 3078.4712 3078.9388 3083.5350 3123.7429 3143.6719 3147.9931 3156.1787 3167.7182 3171.4794 3174.5748 3184.9878
redmass: 4.3966 6.8002 4.4573 5.2326 5.2513 6.8873 6.3633 4.9455 4.9876 5.8173 6.9382 7.7699 7.1660 1.6832 1.5020 6.1201 5.2021 1.4203 2.7937 4.3028 7.3597 5.0875 10.3928 8.7441 4.7549 5.2663 6.5790 3.4439 3.4760 4.9011 6.9921 7.1878 3.0873 6.9319 4.9091 5.1968 8.5564 1.8179 4.7029 3.7532 9.4863 1.3690 1.6580 9.3205 3.0404 1.3508 1.4647 1.3483 5.8038 2.6210 1.5705 1.4367 5.9443 6.0850 1.4237 1.3669 1.3565 2.6303 1.5782 1.5822 2.3695 2.5648 1.8176 1.9765 1.7351 1.0697 1.3795 11.3215 2.1404 1.4595 1.4451 1.3254 1.6956 7.3971 1.9418 2.0314 9.1218 1.2286 2.3827 2.3438 2.3620 2.3314 1.0438 1.0510 1.0506 1.0899 5.4908 6.3736 5.8297 7.0285 1.0349 1.0415 1.0778 1.1003 1.1007 1.0996 1.0998 1.0881 1.0889 1.0921 1.0901 1.0919 1.0943 1.0978 1.0989
irintensity: 0.1944 0.9917 2.6222 2.8635 1.1791 3.3393 0.5876 0.6468 7.1896 0.3019 4.7793 22.4866 1.6622 2.2055 2.8172 1.2079 2.4491 3.4824 1.2443 14.7065 2.0607 10.3955 33.5361 34.4812 7.2068 28.1403 34.8936 14.3400 27.0764 30.9571 1.3932 1.4007 0.1819 3.0716 2.9772 11.4910 15.8630 28.2336 0.8297 12.0427 10.1703 64.3831 12.0879 94.9672 4.7941 1.2751 2.3876 11.8257 50.0100 23.4128 11.0480 0.2917 3.3151 0.2907 0.4594 4.1896 0.0383 1.3250 12.5298 18.5797 57.3906 1.1835 19.0931 11.7035 35.5584 3.5310 3.7675 171.9638 25.4109 10.2733 8.0779 0.3713 1.2026 140.5434 9.5933 14.0554 9.3417 8.3184 9.4987 35.2937 34.4412 9.0831 3.3334 2.3094 16.7198 24.5112 32.3363 18.2662 22.5868 12.6958 29.6696 22.7226 26.1738 2.2270 24.2586 106.0862 32.5711 9.6849 15.5823 24.8328 0.7881 2.8119 16.0303 14.5527 10.8624
temp: 298.150 k
press: 1.00000 atm
elementType: 16 8 8 8 8 8 7 6 6 6 6 6 6 6 6 6 6 6 6 6 6 6 1 1 1 1 1 1 1 1 1 1 1 1 1 1 1
symmnumber: 1
zpe: 711950.5 jmol-1
zpe.correction: 0.271168 hartree
zpe.thermalcorrener: 0.292254 hartree
zpe.thermalcorrenthalpy: 0.293198 hartree
zpe.thermalcorrgfe: 0.218840 hartree
zpe.sumelectzpe: -1407.658926 hartree
zpe.sumelectthermal: -1407.637840 hartree
zpe.sumelectthermalent: -1407.636896 hartree
zpe.sumelectthermalfe: -1407.711254 hartree
dipole: -2.2641 -0.1453 -2.9548
dipole: 3.7254
quadrupole: -84.6000 -141.6711 -144.8445
quadrupole: -1.8811 5.5731 4.2040
quadrupole: 39.1052 -17.9659 -21.1393 -1.8811 5.5731 4.2040
hfenergy: -1407.930094 hartree
pointgroup: C01 [X(C15H15N1O5S1)]
dipole: 1.0006679 1.0625032 0.1340624 debye
polarizability: 391.5365602|-32.3703399|140.2360906|-0.9081794|-1.0453399|234.2951139 unknown
InChI: InChI=1S/C9H11O.C6H4NO4S/c1-7(2)8-4-3-5-9(10)6-8;8-7(9)5-3-1-2-4-6(5)12(10)11/h3-7H,1-2H3;1-4H
charge 0 multiplicity 1
37 atoms
S  0.784985 -1.390046 1.377369
O  -0.157499 0.430279 1.255429
O  0.066256 -2.592313 0.555875
O  1.128843 -1.66793 2.945154
O  2.077546 -0.326176 -3.018725
O  0.473269 -0.634177 -1.430296
N  1.697604 -0.495021 -1.797588
C  -4.489344 -0.060782 -1.175043
C  -3.683795 0.203942 0.099278
C  -2.271871 0.15169 0.09144
C  -4.29414 -1.521729 -1.664363
C  -4.135238 0.949487 -2.298233
C  -1.535486 0.391492 1.287576
C  -4.339055 0.490663 1.328329
C  2.480713 -0.841953 0.609691
C  -2.207184 0.64726 2.52179
C  -3.610628 0.713127 2.52582
C  2.74479 -0.520388 -0.74018
C  3.511391 -0.811824 1.564143
C  4.058685 -0.179773 -1.137418
C  4.822653 -0.463444 1.166534
C  5.094781 -0.150356 -0.183609
H  -5.561808 0.072405 -0.926649
H  -1.709871 -0.074518 -0.819803
H  -3.237745 -1.713554 -1.927301
H  -4.908876 -1.712436 -2.563418
H  -4.583296 -2.248946 -0.884558
H  -4.290108 1.991986 -1.966145
H  -4.766568 0.771464 -3.18824
H  -3.079485 0.844349 -2.609196
H  -5.435194 0.531295 1.349567
H  -1.61197 0.805215 3.426546
H  -4.146291 0.928686 3.456581
H  3.274942 -1.065058 2.603525
H  4.232311 0.059209 -2.190189
H  5.622607 -0.440173 1.913112
H  6.109076 0.118853 -0.493806
