program: Gaussian 09
title: 000286910
version: EM64L-G09RevD.01
frameworkgroup: C1[X(C13H11NO5S)]
method: RPBEPBE
basis: SDD
operation: Freq
keyword: #p
keyword: freq=noraman
keyword: PBEPBE/SDD
title: #p freq=noraman PBEPBE/SDD
converged: YES YES NO NO
title: Mulliken charges:
elementType: S O O O O O N C C C C C C C C C C C C C H H H H H H H H H H H
charge: 0.951257 -0.339491 -0.482502 -0.519929 -0.195696 -0.163068 0.022480 -0.218175 0.142738 0.435192 0.351331 -0.208158 -0.322222 -0.283624 -0.378551 -0.218520 -0.193200 -0.775045 -0.212059 -0.210249 0.311165 0.294687 0.261321 0.243063 0.253300 0.250257 0.251621 0.267447 0.212853 0.237466 0.234310
chargesum: 0.00000
title: Mulliken charges with hydrogens summed into heavy atoms:
elementType: S O O O O O N C C C C C C C C C C C C C
charge: 0.951257 -0.339491 -0.482502 -0.519929 -0.195696 -0.163068 0.022480 -0.218175 0.142738 0.435192 0.351331 0.103007 -0.027536 -0.022303 -0.135487 0.034781 0.057057 -0.043124 0.025407 0.024061
polarizability: 3.81518032e+02 1.04939704e+01 2.09788050e+02 -9.02726045e+00 5.78137736e+00 1.17082670e+02
1716.lowfreq: -8.9825 -5.9676 -0.0019 -0.0018 -0.0014 2.0084 16.2465 23.6282 23.8578
frequency: 15.9027 23.4603 23.7246 37.7427 57.5349 74.0695 96.7081 111.2811 118.7975 146.6794 157.6399 180.0981 208.7210 224.3478 246.0578 298.7798 305.8749 325.8588 370.8026 387.1414 420.4970 433.8942 442.2029 453.8143 501.0598 519.8826 527.5366 543.7685 577.6360 623.1718 655.4148 670.3886 711.0344 719.7596 737.9632 786.5750 787.2942 790.5924 808.6512 842.9179 867.4034 902.3199 906.3458 954.8392 983.1531 987.3107 987.8560 990.5390 1009.4441 1031.2000 1034.5990 1039.4936 1094.0350 1106.6004 1136.9407 1171.0279 1173.7049 1200.2167 1208.4458 1212.5360 1251.7327 1276.0700 1370.0629 1380.2335 1396.4920 1401.9984 1416.3560 1425.7138 1440.0691 1450.6031 1457.4219 1473.3673 1546.1359 1577.1007 1589.5747 1591.6822 2992.6293 3072.4592 3102.0522 3129.5947 3144.2279 3145.0668 3156.2213 3159.2592 3171.3752 3177.2478 3185.3235
redmass: 4.5241 8.0059 7.4483 4.9518 1.3599 3.2576 9.8133 4.9434 6.1538 6.1994 8.9872 7.8556 4.2822 8.2021 8.0777 4.6841 6.1777 5.8054 10.2621 8.8535 5.2931 4.8791 5.0141 3.4003 4.8128 5.5539 6.5455 4.3007 6.1305 6.9924 5.2636 8.6252 1.9604 3.7215 4.0347 5.7114 2.2214 1.3859 10.3877 4.9740 1.3339 2.7629 2.2727 1.4005 1.6719 3.9217 1.6052 1.3583 1.3539 2.5882 2.0556 1.5954 2.3591 1.7972 1.7856 1.1031 1.0700 2.3529 6.6110 4.9729 1.4582 1.5912 5.0199 7.7334 8.2992 1.3316 1.8771 2.3405 2.3735 1.0858 1.9116 1.3625 5.3783 6.3704 7.0770 5.7657 1.0374 1.0952 1.1010 1.0867 1.0906 1.0883 1.0906 1.0948 1.0948 1.0991 1.0986
irintensity: 0.6558 1.9552 4.3274 0.3914 1.7047 6.4051 0.0539 0.3571 21.9256 0.1365 3.5134 1.1616 23.7433 3.6476 0.7651 1.4033 5.1150 23.8136 30.7688 35.3446 27.2347 9.4628 17.0667 37.4016 50.1745 1.3869 1.1381 9.5856 2.8788 4.1206 11.6018 14.3773 20.3554 13.8268 3.7294 18.4654 29.2953 49.1144 98.8549 1.8930 0.9304 30.5605 32.8990 0.9572 2.2651 2.5294 4.1009 0.7629 0.1570 1.1011 4.4570 7.7720 52.7178 9.4272 6.8625 17.5814 2.6602 30.0472 105.8687 132.5781 8.8243 1.1531 20.2710 153.9090 14.3887 17.6006 7.5770 37.1210 31.6598 12.0818 25.3322 47.3507 14.3861 19.6399 13.4300 59.8054 7.3632 8.5222 28.1217 4.9723 14.9386 14.4821 0.7315 30.6254 17.3637 19.7390 9.6535
temp: 298.150 k
press: 1.00000 atm
elementType: 16 8 8 8 8 8 7 6 6 6 6 6 6 6 6 6 6 6 6 6 1 1 1 1 1 1 1 1 1 1 1
symmnumber: 1
zpe: 564896.7 jmol-1
zpe.correction: 0.215158 hartree
zpe.thermalcorrener: 0.234592 hartree
zpe.thermalcorrenthalpy: 0.235536 hartree
zpe.thermalcorrgfe: 0.163686 hartree
zpe.sumelectzpe: -1329.213896 hartree
zpe.sumelectthermal: -1329.194462 hartree
zpe.sumelectthermalent: -1329.193518 hartree
zpe.sumelectthermalfe: -1329.265368 hartree
dipole: -1.0848 -2.8954 -3.6788
dipole: 4.8057
quadrupole: -81.4242 -123.0481 -132.9604
quadrupole: 13.7942 4.4955 4.3225
quadrupole: 31.0533 -10.5705 -20.4828 13.7942 4.4955 4.3225
hfenergy: -1329.4290541 hartree
pointgroup: C01 [X(C13H11N1O5S1)]
dipole: 0.44107 -1.4953599 1.0696121 debye
polarizability: 382.4346214|-0.8492311|204.6986524|-0.4228805|20.7725253|121.2554784 unknown
InChI: InChI=1S/C7H7O.C6H4NO4S/c1-6-4-2-3-5-7(6)8;8-7(9)5-3-1-2-4-6(5)12(10)11/h2-5H,1H3;1-4H
charge 0 multiplicity 1
31 atoms
S  0.291904 -0.164759 -0.970714
O  -0.931593 -0.194226 0.754388
O  0.294281 1.13007 -1.960369
O  0.016473 -1.615892 -1.671795
O  2.916996 2.870804 1.367799
O  0.879727 2.148985 0.640116
N  2.12838 1.969549 0.889027
C  2.003345 -0.375567 -0.097038
C  -2.268275 -0.310799 0.509453
C  2.699155 0.621359 0.618791
C  -3.100525 0.870087 0.528423
C  2.569884 -1.646557 -0.287175
C  3.984703 0.348809 1.138931
C  -2.83185 -1.60908 0.291331
C  -4.492938 0.685955 0.385427
C  3.85157 -1.922856 0.242866
C  4.557786 -0.924865 0.950835
C  -2.477723 2.234423 0.703198
C  -4.220342 -1.75345 0.14212
C  -5.050673 -0.603066 0.193343
H  2.006233 -2.396295 -0.853055
H  4.501962 1.143933 1.682872
H  -2.15203 -2.465926 0.253224
H  -5.151996 1.561107 0.414446
H  4.292529 -2.913763 0.095618
H  5.551161 -1.137103 1.357915
H  -1.839507 2.268484 1.603562
H  -1.808598 2.476924 -0.142975
H  -3.248911 3.018955 0.776444
H  -4.660421 -2.743367 -0.016153
H  -6.13511 -0.710073 0.076847
