program: Gaussian 09
title: 000027428
version: EM64L-G09RevD.01
frameworkgroup: C1[X(C6H4Cl5N3)]
method: RPBEPBE
basis: SDD
operation: Freq
keyword: #p
keyword: freq=noraman
keyword: PBEPBE/SDD
title: #p freq=noraman PBEPBE/SDD
converged: YES YES NO NO
title: Mulliken charges:
elementType: Cl Cl Cl Cl Cl N N N C C C C C C H H H H
charge: 0.121750 0.156959 0.110876 0.053787 0.049930 0.082064 0.041803 -0.017562 0.266231 0.205979 0.072494 -0.780161 -0.745651 -0.740629 0.355361 0.261361 0.252904 0.252503
chargesum: 0.00000
title: Mulliken charges with hydrogens summed into heavy atoms:
elementType: Cl Cl Cl Cl Cl N N N C C C C C C
charge: 0.121750 0.156959 0.110876 0.053787 0.049930 0.082064 0.041803 -0.017562 0.266231 0.205979 0.072494 -0.780161 -0.390290 0.026139
polarizability: 1.44446071e+02 -1.09339007e+01 1.43997960e+02 5.89829411e-01 4.35698624e-01 1.13962902e+02
1716.lowfreq: -6.6752 -0.0011 0.0029 0.0036 4.0577 4.3587 15.6777 21.3072 46.5752
frequency: 14.3946 21.2547 46.5730 70.3514 82.8163 92.2653 142.4800 170.2115 192.5717 214.8849 218.7843 242.6954 248.3996 293.9613 295.6785 339.3115 380.2753 441.5654 556.8548 594.2527 611.6698 637.2266 691.0450 699.0590 739.9047 764.8007 772.5501 852.7829 911.4867 952.8755 966.6402 1042.2417 1051.0518 1159.2761 1210.7473 1224.8498 1293.0499 1330.4173 1378.9369 1407.0801 1435.2780 1452.3971 1463.4690 1489.6064 3001.5818 3081.2728 3143.7228 3157.9745
redmass: 24.7183 12.1329 1.0391 10.0612 23.2656 16.6519 14.9509 4.9299 7.0198 19.0596 15.6587 14.3496 15.8225 7.2146 14.3213 16.6910 28.1528 4.8765 6.4605 4.6956 11.8314 9.4907 6.8685 7.2212 7.7144 9.4283 10.8414 9.3941 12.6549 3.4858 4.9731 2.7846 1.6853 4.6347 1.0656 1.7041 4.9151 6.2836 2.1600 2.0666 1.7120 1.0460 5.1746 3.0009 1.0385 1.0961 1.1000 1.0891
irintensity: 0.3340 0.0435 0.7527 0.0046 0.4614 0.1493 0.4822 1.5133 2.3079 0.2071 0.6556 1.2988 0.2656 0.0944 0.3943 3.1255 0.7314 10.9771 16.9254 52.8311 2.3129 54.3802 214.2530 59.8875 21.6570 97.4092 2.2859 4.1154 0.6039 19.5543 14.3190 10.4847 11.2229 1.7414 8.2617 6.1756 12.8741 50.4921 5.5546 47.8771 198.7263 17.2432 200.8215 180.7244 0.0843 3.7876 5.8318 0.0156
temp: 298.150 k
press: 1.00000 atm
elementType: 17 17 17 17 17 7 7 7 6 6 6 6 6 6 1 1 1 1
symmnumber: 1
zpe: 254700.4 jmol-1
zpe.correction: 0.097010 hartree
zpe.thermalcorrener: 0.112044 hartree
zpe.thermalcorrenthalpy: 0.112988 hartree
zpe.thermalcorrgfe: 0.050273 hartree
zpe.sumelectzpe: -2694.526019 hartree
zpe.sumelectthermal: -2694.510985 hartree
zpe.sumelectthermalent: -2694.510041 hartree
zpe.sumelectthermalfe: -2694.572756 hartree
dipole: 0.8527 3.7804 -0.1998
dipole: 3.8805
quadrupole: -121.0850 -107.0577 -114.2903
quadrupole: 3.2892 -0.0622 -0.0883
quadrupole: -6.9407 7.0866 -0.1460 3.2892 -0.0622 -0.0883
hfenergy: -2694.6230289 hartree
pointgroup: C01 [X(C6H4Cl5N3)]
dipole: -0.4318138 -1.462588 -0.0720891 debye
dipolederiv: -0.393297 0.0885401 0.2897873 0.0724468 -0.200803 -0.1564248 0.2372538 -0.1647849 -0.4786993 -0.1097397 0.0735687 -0.0087095 0.10378 -0.6416785 0.0698326 -0.0197463 0.0571915 -0.1161771 -0.3378737 -0.0030059 -0.253242 -0.0141094 -0.1698178 0.1005127 -0.2184175 0.1093125 -0.6345653 -0.2196305 0.1042751 -0.07463 0.1637196 -0.2366317 0.2695275 -0.1039857 0.1521252 -0.5190398 -0.2367287 0.1031501 0.0853134 0.1585681 -0.2000225 -0.229902 0.1259252 -0.1206553 -0.5621656 -1.168511 0.0281668 -0.0051558 -0.0974185 -0.3616081 0.005881 0.0130044 -0.0060879 -0.0919943 -0.5824983 -0.3259218 -0.0016683 -0.3028177 -1.0191603 -0.0211831 0.0001681 0.0072748 -0.1307516 -0.6892647 0.3384257 -0.0008011 0.2391005 -0.9390734 -0.012592 -0.0022324 -0.0068204 -0.1722801 0.952986 0.2870751 0.0199673 0.2658545 0.521398 0.0152185 0.0650102 0.0359477 -0.0033549 0.9590038 -0.2951403 -0.0085706 -0.1233641 0.5596517 0.017343 -0.0325797 0.0239258 0.0237054 0.5280565 0.0061747 0.0053599 -0.000756 1.3637645 0.0124506 -0.0010795 -0.0073251 0.1548944 0.7254341 -0.272199 -0.0434144 -0.1824788 1.1284389 -0.0216706 -0.0649157 -0.0356646 1.2742727 0.3815625 -0.1233558 -0.0052061 -0.2086175 0.4298399 -0.0465244 0.0004124 -0.0466844 1.1747691 0.0144645 -0.1767855 -0.0004686 -0.0215484 -0.4820858 -0.0028069 0.0012618 0.0023535 -0.0238462 0.0505036 0.0267215 0.0007073 -0.0429542 -0.0008025 0.0004002 0.0001547 0.00208 -0.0293852 -0.0456936 0.0872683 0.0009375 0.0027376 0.0889965 0.0001171 0.0003842 -0.0009646 0.1221953 0.0860512 0.0263705 0.0846328 -0.0061461 0.0796811 0.0238679 0.071344 0.0583171 0.006194 0.085175 0.0266716 -0.084839 -0.0059963 0.0799131 -0.0240476 -0.071962 -0.0595407 0.0062285 unknown
polarizability: 143.0183815|-10.8753337|145.4137784|-0.7965119|-0.394253|113.9747731 unknown
InChI: InChI=1S/C6H4Cl5N3/c1-2-12-4(3(7)8)14-5(13-2)6(9,10)11/h3H,1H3
charge 0 multiplicity 1
18 atoms
Cl 3.287499 0.241404 -1.359089
Cl 1.892685 2.643437 -0.193351
Cl 3.002796 0.523237 1.651803
Cl -3.010628 1.64078 -1.470578
Cl -3.027406 1.471894 1.594856
N  -0.309698 0.700983 -0.006895
N  1.009843 -1.327759 -0.016275
N  -1.402666 -1.463696 -0.026704
C  0.866972 0.032225 -0.014649
C  -1.417149 -0.10514 -0.012805
C  -0.150515 -2.047721 -0.023103
C  2.172157 0.838689 0.005576
C  -2.786338 0.531702 0.004158
C  -0.076533 -3.544184 -0.025803
H  -3.571311 -0.230502 -0.038932
H  0.970992 -3.876064 -0.027585
H  -0.596244 -3.951005 0.860275
H  -0.599356 -3.948682 -0.910998
