program: Gaussian 09
title: 000286878
version: EM64L-G09RevD.01
frameworkgroup: C1[X(C17H16)]
method: RPBEPBE
basis: SDD
operation: Freq
keyword: #p
keyword: freq=noraman
keyword: PBEPBE/SDD
title: #p freq=noraman PBEPBE/SDD
converged: YES YES NO NO
title: Mulliken charges:
elementType: C C C C C C C C C C C C C C C C C H H H H H H H H H H H H H H H H
charge: -0.510411 -0.510411 -0.415807 -0.415807 -0.422461 0.380264 0.380939 0.380263 0.380938 -0.462722 -0.462240 -0.462722 -0.462240 -0.241349 -0.240976 -0.241349 -0.240975 0.219401 0.219401 0.208149 0.217752 0.217751 0.208148 0.202423 0.223272 0.239483 0.238702 0.239483 0.238702 0.223778 0.223421 0.223779 0.223421
chargesum: 0.00000
title: Mulliken charges with hydrogens summed into heavy atoms:
elementType: C C C C C C C C C C C C C C C C C
charge: -0.291010 -0.291010 0.010093 0.010093 0.003233 0.380264 0.380939 0.380263 0.380938 -0.223239 -0.223538 -0.223239 -0.223538 -0.017570 -0.017555 -0.017570 -0.017555
polarizability: 2.10775296e+02 1.59398613e+00 1.24755494e+02 7.53929351e-04 4.64382915e-04 1.70501691e+02
1716.lowfreq: -5.2988 -0.0005 0.0002 0.0003 8.5520 18.9732 65.2598 121.3808 126.2334
frequency: 65.2553 121.3656 126.2327 143.5556 211.1792 250.5727 258.5814 331.6266 346.4093 369.2665 370.7777 378.0126 463.6910 469.7494 505.4953 564.4929 572.4153 588.4245 608.7613 640.8598 682.1176 722.4004 753.6897 753.7340 760.4709 784.1169 786.0734 807.2696 810.7828 853.4333 872.5010 880.7713 908.7421 915.6979 931.6943 943.1968 949.9077 982.3242 983.1905 1010.6916 1030.9926 1034.5572 1056.9664 1075.7049 1104.3374 1108.4627 1148.3958 1163.1402 1171.1263 1171.7824 1178.9029 1197.1141 1199.1835 1217.1893 1228.6358 1235.8131 1236.8838 1268.9007 1294.9096 1302.8966 1332.1371 1339.2880 1344.4735 1360.0818 1389.3167 1394.7745 1439.9846 1449.3344 1460.8499 1462.8943 1468.6558 1472.4151 1487.7604 1588.8825 1600.6990 1610.3753 1617.9060 2972.4332 2976.5385 2989.8554 3012.6884 3014.4251 3027.2308 3035.3004 3051.4860 3112.6464 3113.0352 3117.6080 3117.9769 3135.3644 3135.6142 3157.4548 3157.8828
redmass: 4.8158 3.4488 3.7692 3.8519 2.2919 4.0593 2.1002 2.8176 3.7333 4.5155 4.8270 5.1762 3.4121 3.0423 4.7745 2.7282 3.6819 3.5887 4.7776 3.2066 5.7600 3.7428 1.3884 3.8989 1.3485 2.4068 3.9637 2.5930 2.3284 2.8556 1.3825 1.8090 2.3989 2.1483 3.1788 1.3989 1.5428 1.3181 1.3170 2.6165 2.3137 2.1939 1.7788 2.1644 1.9396 2.1214 1.3596 1.4110 1.0607 1.0563 2.2007 1.4817 1.4692 1.7074 1.5204 1.9426 1.4450 1.3857 1.3031 2.0601 1.3137 1.3762 1.4649 1.3966 7.5350 4.9738 2.3056 2.3199 1.1270 1.1181 1.4686 1.5852 2.4306 6.1659 7.1586 6.7037 6.8840 1.0600 1.0603 1.0628 1.0851 1.0880 1.0986 1.1034 1.1024 1.0861 1.0860 1.0894 1.0895 1.0930 1.0931 1.1003 1.1003
irintensity: 0.6437 0.0023 0.7995 0.0211 0.0007 0.1332 0.6214 0.6050 1.5146 0.0009 0.3495 0.0008 4.6260 8.1969 0.0003 21.4230 0.0000 0.0369 4.5920 6.5245 2.1125 1.5968 18.6851 0.0231 123.4009 4.2326 0.0116 2.4460 0.4301 0.0000 0.0005 0.1275 3.0923 0.3602 1.0252 0.3027 2.8625 0.0008 0.0043 1.6043 14.7763 5.8342 12.8971 0.0484 0.0730 10.1262 1.6377 2.6240 0.0885 0.0149 1.5096 0.3539 0.5501 0.7269 0.0580 5.9098 3.1778 0.0001 4.4590 0.2591 1.0142 1.0936 0.7323 0.0260 0.0654 1.7257 9.8470 0.5811 9.6044 3.1703 30.4480 18.5235 11.7808 2.6431 0.6328 0.0013 0.1705 10.6905 37.9016 69.3086 69.2142 6.7620 30.8410 14.5887 83.5049 1.8351 17.1246 3.0876 1.1553 1.1912 58.8945 68.3100 11.3742
temp: 298.150 k
press: 1.00000 atm
elementType: 6 6 6 6 6 6 6 6 6 6 6 6 6 6 6 6 6 1 1 1 1 1 1 1 1 1 1 1 1 1 1 1 1
symmnumber: 1
zpe: 728841.6 jmol-1
zpe.correction: 0.277601 hartree
zpe.thermalcorrener: 0.289926 hartree
zpe.thermalcorrenthalpy: 0.290870 hartree
zpe.thermalcorrgfe: 0.239658 hartree
zpe.sumelectzpe: -656.237127 hartree
zpe.sumelectthermal: -656.224801 hartree
zpe.sumelectthermalent: -656.223857 hartree
zpe.sumelectthermalfe: -656.275070 hartree
dipole: -0.1156 0.8207 0.0000
dipole: 0.8288
quadrupole: -95.3204 -102.7028 -89.7460
quadrupole: 0.2255 -0.0001 0.0001
quadrupole: 0.6026 -6.7797 6.1771 0.2255 -0.0001 0.0001
hfenergy: -656.5147278 hartree
pointgroup: C01 [X(C17H16)]
dipole: -0.0397775 -0.3236313 0.0000035 debye
polarizability: 210.8047569|-0.0756857|124.7260337|-0.000762|0.000451|170.5016915 unknown
InChI: InChI=1S/C17H16/c1-2-7-13-12(6-1)16-10-5-11-17(13)15-9-4-3-8-14(15)16/h1-4,6-9,16-17H,5,10-11H2
charge 0 multiplicity 1
33 atoms
C  0.030292 -0.439795 1.399437
C  0.03024 -0.439821 -1.399435
C  0.020599 -2.014442 1.316848
C  0.020549 -2.014466 -1.316817
C  -0.567077 -2.586787 0.000032
C  1.278171 0.111143 0.709982
C  -1.206081 0.139927 0.712544
C  1.278145 0.11113 -0.710035
C  -1.206107 0.139914 -0.712506
C  2.403702 0.590676 1.411968
C  -2.319723 0.649389 1.412212
C  2.40365 0.590648 -1.412073
C  -2.319775 0.649363 -1.412143
C  3.535241 1.067468 0.706503
C  -3.437162 1.158252 0.706574
C  3.535215 1.067454 -0.706659
C  -3.437188 1.158239 -0.706473
H  0.042378 -0.154987 2.46814
H  0.042287 -0.155033 -2.468143
H  -0.585152 -2.407455 2.156948
H  1.056532 -2.37514 1.467167
H  1.056477 -2.375168 -1.467168
H  -0.585234 -2.407495 -2.156887
H  -0.431429 -3.686497 0.00004
H  -1.659238 -2.409066 0.000051
H  2.399199 0.597306 2.509051
H  -2.316268 0.653465 2.509293
H  2.399107 0.597256 -2.509156
H  -2.316361 0.653418 -2.509224
H  4.406161 1.442172 1.256077
H  -4.297208 1.557202 1.2562
H  4.406114 1.442147 -1.256273
H  -4.297255 1.557178 -1.256074
