program: Gaussian 09
title: 000286888
version: EM64L-G09RevD.01
frameworkgroup: C1[X(C13H17NO3)]
method: RPBEPBE
basis: SDD
operation: Freq
keyword: #p
keyword: freq=noraman
keyword: PBEPBE/SDD
title: #p freq=noraman PBEPBE/SDD
converged: YES YES NO NO
title: Mulliken charges:
elementType: O O O N C C C C C C C C C C C C C H H H H H H H H H H H H H H H H H
charge: -0.286281 -0.282997 -0.439234 -0.089559 -0.382682 -0.572933 -0.387728 0.422313 -0.507466 0.244688 0.029184 -0.612240 -0.523210 0.205020 0.224526 -0.520056 -0.536462 0.204381 0.205395 0.210444 0.215530 0.211730 0.209978 0.213035 0.258869 0.259253 0.269336 0.259507 0.210679 0.227816 0.241204 0.226826 0.226138 0.364995
chargesum: 0.00000
title: Mulliken charges with hydrogens summed into heavy atoms:
elementType: O O O N C C C C C C C C C C C C C
charge: -0.286281 -0.282997 -0.074239 -0.089559 0.027094 -0.146958 0.033979 0.422313 -0.035561 0.244688 0.029184 -0.352986 -0.253875 0.205020 0.224526 0.177946 0.157706
polarizability: 2.23541469e+02 -7.78631143e+00 1.77964989e+02 2.92980753e+00 -3.05244926e+00 1.00401182e+02
1716.lowfreq: -8.9576 -4.0745 -2.2903 -0.0008 -0.0005 -0.0003 42.8301 52.9151 65.4087
frequency: 42.8119 52.7973 65.3960 80.0148 106.2938 136.5718 143.8086 157.8292 195.4996 221.4888 229.8306 250.0796 277.3465 277.9484 302.5700 323.3413 349.6296 363.5385 371.1027 414.6629 438.2277 465.1552 470.5690 510.3327 545.5456 606.4263 642.7961 663.7953 692.8015 711.6862 737.2654 754.0460 816.1703 839.8137 854.1702 863.4512 882.7646 901.1497 916.5922 943.9129 973.5815 989.3679 1054.2753 1067.8803 1096.5503 1112.3491 1112.7518 1123.2970 1140.0358 1147.2856 1165.8851 1170.2534 1197.1945 1223.7125 1241.8556 1249.6658 1270.2706 1278.0093 1320.2670 1322.1785 1338.1177 1353.6761 1367.5969 1369.1519 1396.7818 1430.6837 1444.8944 1454.7135 1457.4982 1461.5412 1465.6667 1465.7769 1470.0783 1474.4547 1481.2708 1502.7384 1558.0092 1571.5535 1611.3535 2958.3513 2962.8780 2970.8665 2975.6615 2980.0697 2988.7036 3026.8713 3031.5714 3042.6707 3052.0263 3077.3239 3084.8520 3123.2828 3127.4013 3146.2456 3167.7893 3569.2043
redmass: 4.1738 3.2194 2.2720 3.2763 3.4779 1.8175 2.8944 2.8121 2.8731 2.7142 1.7621 3.1525 4.5641 2.7945 4.1151 3.0082 3.0722 4.2454 2.9391 1.7982 1.5157 3.7955 4.1191 3.7465 3.0861 4.6339 5.2797 4.4129 4.7954 5.0921 3.0856 2.8791 2.8763 3.4399 1.8901 1.9916 1.5740 2.2697 2.5554 2.7189 3.8027 6.0656 2.2081 2.3134 2.2695 1.2384 1.2575 2.0647 1.3895 1.5165 1.5820 1.9592 1.5497 1.4515 1.2881 1.3596 2.0849 1.2933 1.5313 1.4981 1.8468 1.4191 1.5645 7.4971 3.1308 1.2197 1.3122 1.0686 1.0929 1.1013 1.0829 1.0639 1.1176 1.0829 1.0543 2.8661 7.5467 7.6322 7.0362 1.0653 1.0325 1.0599 1.0349 1.0622 1.0647 1.1014 1.0946 1.1017 1.1041 1.0969 1.0967 1.1000 1.1048 1.0911 1.0904 1.0673
irintensity: 1.0730 2.5510 4.0186 2.7740 4.1971 0.7820 0.9367 2.4208 2.1163 1.3096 1.2822 4.5960 2.9239 1.7708 3.1339 7.5036 2.5918 7.6936 13.1591 53.8996 60.2080 5.8540 0.1610 13.0741 1.9743 21.9751 19.2616 11.3085 2.7216 11.5774 3.3862 23.8327 37.2068 60.4324 35.9944 12.1114 28.0254 9.9903 43.4993 11.0810 42.9096 51.9688 36.2968 11.8894 24.9518 10.4474 0.2515 25.0043 32.0271 9.1564 23.9840 39.0607 38.1061 28.3197 1.4109 52.0928 185.8572 35.0429 9.8784 3.1702 18.0939 14.1601 23.0485 5.9336 25.1345 0.6225 7.0563 13.8069 15.2266 6.4855 1.2697 24.8589 29.8040 58.0037 29.3159 109.7629 23.8303 25.8250 22.0466 27.2647 57.7994 25.6123 100.0064 49.3310 14.1855 43.4436 45.8243 63.5306 43.5448 13.8567 40.4594 24.7377 17.7767 7.2428 3.4745 52.1630
temp: 298.150 k
press: 1.00000 atm
elementType: 8 8 8 7 6 6 6 6 6 6 6 6 6 6 6 6 6 1 1 1 1 1 1 1 1 1 1 1 1 1 1 1 1 1
symmnumber: 1
zpe: 728748.4 jmol-1
zpe.correction: 0.277566 hartree
zpe.thermalcorrener: 0.294502 hartree
zpe.thermalcorrenthalpy: 0.295446 hartree
zpe.thermalcorrgfe: 0.233163 hartree
zpe.sumelectzpe: -784.640439 hartree
zpe.sumelectthermal: -784.623503 hartree
zpe.sumelectthermalent: -784.622558 hartree
zpe.sumelectthermalfe: -784.684842 hartree
dipole: 0.0433 1.6895 -0.5343
dipole: 1.7725
quadrupole: -93.2364 -88.4635 -101.0641
quadrupole: 8.0779 -3.4296 1.7352
quadrupole: 1.0183 5.7912 -6.8095 8.0779 -3.4296 1.7352
hfenergy: -784.9180048 hartree
pointgroup: C01 [X(C13H17N1O3)]
dipole: 0.0596966 -0.6655357 0.199558 debye
polarizability: 221.9883626|9.7462805|178.8476293|-9.8095527|-2.877354|101.0716479 unknown
InChI: InChI=1S/C13H17NO3/c1-16-12-7-9-5-3-4-6-11(14-15)10(9)8-13(12)17-2/h7-8,15H,3-6H2,1-2H3
charge 0 multiplicity 1
34 atoms
O  3.271459 1.802403 -0.354852
O  3.090576 -1.050484 -0.62378
O  -3.174841 -2.534294 0.832256
N  -1.85806 -1.862755 0.888727
C  -2.75786 2.262765 -0.327204
C  -1.528709 2.225505 0.619493
C  -3.661447 1.013567 -0.241386
C  -0.373167 1.315349 0.212244
C  -2.989404 -0.297122 -0.732571
C  -0.50537 -0.095965 0.061186
C  -1.832914 -0.78284 0.125496
C  0.921599 1.872155 0.088314
C  0.644767 -0.888733 -0.190798
C  2.070477 1.096759 -0.175605
C  1.927272 -0.316566 -0.321975
C  4.477473 1.320826 0.350811
C  2.940881 -2.49387 -0.825638
H  -3.36633 3.151455 -0.065504
H  -2.416505 2.407661 -1.371815
H  -1.885296 1.929717 1.62904
H  -1.134434 3.253727 0.721546
H  -4.566326 1.179099 -0.858832
H  -4.009081 0.877251 0.801773
H  -2.605397 -0.131401 -1.75852
H  -3.748712 -1.09607 -0.774907
H  1.072988 2.94993 0.211332
H  0.502696 -1.966987 -0.300263
H  4.768355 0.317778 0.000992
H  4.30099 1.302706 1.443861
H  5.255999 2.060982 0.110502
H  3.952351 -2.856886 -1.06094
H  2.259886 -2.710762 -1.671063
H  2.566968 -2.992798 0.089247
H  -3.034087 -3.290003 1.458129
