program: Gaussian 09
title: 000286909
version: EM64L-G09RevD.01
frameworkgroup: C1[X(C16H17NO5S)]
method: RPBEPBE
basis: SDD
operation: Freq
keyword: #p
keyword: freq=noraman
keyword: PBEPBE/SDD
title: #p freq=noraman PBEPBE/SDD
converged: YES YES NO NO
title: Mulliken charges:
elementType: S O O O O O N C C C C C C C C C C C C C C C C H H H H H H H H H H H H H H H H H
charge: 0.961598 -0.363816 -0.475806 -0.514372 -0.197531 -0.175901 0.023949 0.130905 0.554129 -0.699443 -0.696043 -0.739473 -0.513668 -0.403394 0.287235 -0.217981 -0.364127 -0.209444 0.432907 -0.208461 -0.324588 -0.218985 -0.192991 0.213099 0.211654 0.224940 0.211156 0.211693 0.232279 0.215900 0.218890 0.232895 0.305728 0.236293 0.232075 0.263726 0.314976 0.295509 0.254014 0.250472
chargesum: 0.00000
title: Mulliken charges with hydrogens summed into heavy atoms:
elementType: S O O O O O N C C C C C C C C C C C C C C C C
charge: 0.961598 -0.363816 -0.475806 -0.514372 -0.197531 -0.175901 0.023949 0.130905 0.554129 -0.049750 -0.040915 -0.071788 -0.207940 -0.167101 0.287235 0.014094 -0.100400 -0.209444 0.432907 0.106515 -0.029078 0.035029 0.057480
polarizability: 4.26601330e+02 -8.98554592e+00 2.43874026e+02 -5.41207398e+00 2.43870600e+00 1.43219826e+02
1716.lowfreq: -7.4680 0.0011 0.0014 0.0019 1.6168 7.1478 12.6105 18.3688 25.1524
frequency: 12.1359 17.8891 25.0403 34.6725 40.8047 73.0476 106.7365 109.3533 124.8335 135.5020 145.7614 170.2235 182.4869 204.7461 216.6780 230.1076 243.5728 261.1072 286.9453 299.9880 305.3565 312.2685 328.8967 336.1214 373.9838 381.5490 390.5640 407.8925 424.7595 438.4651 465.2094 481.4082 504.7772 518.1998 523.4177 543.1820 621.3953 645.6494 654.9126 669.2862 682.0985 687.0958 717.6429 786.9266 790.9203 806.3306 813.3837 819.3699 904.7082 911.2882 915.3139 920.2846 922.6653 933.6035 943.5373 947.4134 984.3195 985.4834 987.3456 989.3999 1010.5551 1022.2570 1027.7975 1033.1829 1078.3801 1091.9915 1113.8162 1138.5744 1160.1687 1174.3348 1195.3964 1205.9742 1209.7207 1216.4672 1252.3467 1273.0286 1298.6123 1376.8889 1378.2109 1378.8939 1384.5410 1396.0242 1398.9769 1408.5225 1425.2079 1440.3335 1459.3469 1460.7448 1466.0012 1471.9425 1482.1177 1487.7686 1498.0533 1558.0521 1576.5458 1584.9846 1588.2921 2974.2904 2975.6024 2980.6689 3069.8575 3071.0567 3073.7458 3078.7568 3079.2790 3081.9515 3130.1507 3143.2082 3150.0114 3155.6120 3170.7582 3174.1480 3184.6785 3191.2909
redmass: 7.4786 7.2826 5.2998 4.9143 3.7501 7.5085 9.3322 5.1533 3.5788 5.5966 7.3408 9.8110 8.0691 1.1496 2.8488 7.4911 8.9021 1.0914 3.3858 1.3053 6.0941 2.2237 4.8680 2.6879 9.6833 2.5490 8.9008 3.9411 5.2618 6.3382 3.7147 3.5630 4.7963 3.0367 7.2903 6.2499 6.9481 4.8553 5.1849 8.5093 4.3437 1.9960 3.7434 9.5367 1.3699 2.4475 2.2099 7.0536 1.3553 1.6830 3.0866 9.6764 1.5982 1.6625 1.4866 1.2220 6.3479 6.2015 1.3871 1.3746 1.3563 1.4387 1.3860 2.6283 1.6829 2.3522 1.6422 1.8008 1.9344 1.0703 1.6033 2.9791 11.3057 2.7665 1.4578 3.0848 1.3649 2.0069 1.2806 6.4417 1.9557 8.5833 2.9769 1.2122 2.3366 2.3571 1.7586 1.0517 1.0494 1.2088 1.0861 1.0527 1.0749 5.1208 6.3713 5.9186 7.0363 1.0345 1.0349 1.0361 1.1000 1.1000 1.1006 1.0987 1.0996 1.0996 1.0865 1.0887 1.0927 1.0902 1.0944 1.0977 1.0987 1.0913
irintensity: 0.6117 1.5557 4.0660 0.7020 0.5948 6.0971 0.1706 1.2215 3.3956 0.8790 10.7537 21.7568 1.2142 0.2944 1.7431 1.3396 3.9692 0.0750 9.7481 4.6095 4.0049 3.8729 14.4169 0.4968 32.9858 0.9538 35.4552 7.2353 24.8600 34.8330 23.7921 17.5736 30.3310 0.5470 1.3918 1.3882 3.1154 2.2285 11.4045 15.6570 6.6414 20.2236 12.2330 9.3634 64.2962 4.9768 6.3309 98.7602 1.7485 3.3343 18.1051 62.5153 3.1728 1.5660 14.0517 0.3126 4.3752 0.2540 0.2555 4.2817 0.0285 4.5565 0.1676 1.2523 12.3327 57.4426 3.2831 11.9265 89.5406 3.8980 24.3622 6.7500 180.4045 0.2546 11.7522 20.0047 6.2244 22.8541 28.7274 127.4567 15.0591 10.6437 11.1740 12.4128 35.0351 36.2776 12.8453 0.1049 0.5920 6.3826 18.7665 13.0999 29.1875 39.4410 20.1247 20.6667 12.4816 30.4113 35.6691 21.0917 2.2864 6.6733 9.4901 92.2049 41.2826 67.1352 7.4407 15.7402 27.9421 1.0938 17.3187 12.1557 11.1490 3.6182
temp: 298.150 k
press: 1.00000 atm
elementType: 16 8 8 8 8 8 7 6 6 6 6 6 6 6 6 6 6 6 6 6 6 6 6 1 1 1 1 1 1 1 1 1 1 1 1 1 1 1 1 1
symmnumber: 1
zpe: 784195.1 jmol-1
zpe.correction: 0.298684 hartree
zpe.thermalcorrener: 0.321869 hartree
zpe.thermalcorrenthalpy: 0.322813 hartree
zpe.thermalcorrgfe: 0.243416 hartree
zpe.sumelectzpe: -1446.881170 hartree
zpe.sumelectthermal: -1446.857985 hartree
zpe.sumelectthermalent: -1446.857040 hartree
zpe.sumelectthermalfe: -1446.936438 hartree
dipole: -1.9198 0.2590 -2.8950
dipole: 3.4833
quadrupole: -89.3462 -147.8223 -151.4958
quadrupole: -4.4604 6.5907 3.7596
quadrupole: 40.2085 -18.2676 -21.9410 -4.4604 6.5907 3.7596
hfenergy: -1447.1798537 hartree
pointgroup: C01 [X(C16H17N1O5S1)]
dipole: 0.7364877 -0.1913593 1.1397804 debye
polarizability: 426.5857093|10.0224324|238.5358315|1.7232994|22.9285298|148.5736417 unknown
InChI: InChI=1S/C10H13O.C6H4NO4S/c1-10(2,3)8-5-4-6-9(11)7-8;8-7(9)5-3-1-2-4-6(5)12(10)11/h4-7H,1-3H3;1-4H
charge 0 multiplicity 1
40 atoms
S  1.245229 -0.970921 -0.902424
O  0.032705 -1.223901 0.75754
O  0.648544 -0.004018 -2.063753
O  1.745107 -2.45207 -1.363317
O  1.991793 3.193178 1.154109
O  0.610955 1.619437 0.254638
N  1.760652 2.020268 0.669254
C  -4.390918 1.089415 0.244939
C  -3.501795 -0.174075 0.296001
C  -5.445865 1.024184 1.390412
C  -5.121542 1.142032 -1.13132
C  -3.566507 2.391374 0.411201
C  -2.101978 -0.111064 0.454181
C  -4.093806 -1.466652 0.166007
C  -1.316324 -1.303301 0.501199
C  -3.319137 -2.651744 0.191164
C  -1.922776 -2.584486 0.343109
C  2.793228 -0.214553 -0.004649
C  2.89557 1.061808 0.591694
C  3.894247 -1.0873 -0.012699
C  4.119276 1.472344 1.17014
C  5.115385 -0.677159 0.570129
C  5.226916 0.602389 1.158145
H  -6.095423 1.918685 1.357398
H  -6.094799 0.133576 1.30529
H  -4.952502 0.991742 2.379107
H  -5.753854 0.250935 -1.29678
H  -5.774265 2.033611 -1.178638
H  -4.393404 1.201166 -1.960508
H  -4.243135 3.263791 0.360828
H  -3.046211 2.427014 1.38599
H  -2.811239 2.505981 -0.387302
H  -1.574063 0.840675 0.544992
H  -5.178617 -1.552192 0.033893
H  -3.812001 -3.624107 0.084893
H  -1.292161 -3.478782 0.362147
H  3.781755 -2.073569 -0.476346
H  4.167251 2.467567 1.620529
H  5.971499 -1.359042 0.560416
H  6.171509 0.921461 1.609187
