program: Gaussian 09
title: 000286884
version: EM64L-G09RevD.01
frameworkgroup: C1[X(C14H14O4)]
method: RPBEPBE
basis: SDD
operation: Freq
keyword: #pfreq=noraman
keyword: PBEPBE/SDD
title: #p freq=noraman PBEPBE/SDD
converged: YES YES NO NO
title: Mulliken charges:
elementType: O O O O C C C C C C C C C C C C C C H H H H H H H H H H H H H H
charge: -0.273702 -0.307721 -0.211635 -0.195642 0.202316 -0.517814 0.439357 -0.454699 0.055615 -0.334308 -0.495756 -0.188751 -0.515445 0.148777 0.272732 -0.521455 0.254297 -0.749059 0.231963 0.241839 0.238488 0.225072 0.219355 0.304185 0.209863 0.255148 0.222158 0.248129 0.236101 0.251232 0.252073 0.257288
chargesum: 0.00000
title: Mulliken charges with hydrogens summed into heavy atoms:
elementType: O O O O C C C C C C C C C C C C C C
charge: -0.273702 -0.307721 -0.211635 -0.195642 0.202316 -0.044012 0.439357 0.008862 0.055615 -0.114953 -0.191571 0.021112 -0.260298 0.148777 0.272732 0.184932 0.254297 0.011533
polarizability: 2.61014780e+02 1.60493607e+01 1.82043195e+02 -1.32467831e+00 4.60898780e+00 9.27177189e+01
1716.lowfreq: -13.4438 -9.1494 -6.2700 -0.0007 -0.0005 -0.0002 24.6807 36.1742 47.1738
frequency: 24.5344 35.7947 47.1630 63.5761 73.0650 82.7878 94.3953 133.1911 153.4417 175.6849 205.0512 224.2968 241.0903 272.0073 281.3640 335.5452 349.4362 379.5686 414.8684 449.4663 467.4844 487.9821 527.8262 547.7570 557.6974 602.4466 623.7601 642.7300 681.7082 710.9481 750.4120 759.5537 770.9825 787.0209 829.3692 877.1114 892.1437 903.0663 926.4454 945.8925 984.3179 988.0122 995.5287 1012.3892 1039.7533 1078.1837 1107.6002 1109.8885 1139.2140 1152.0725 1162.5634 1176.8098 1191.3012 1237.2982 1248.6784 1273.7678 1285.2317 1312.1911 1349.0892 1360.1707 1383.3901 1387.4266 1424.9427 1434.2602 1451.9151 1452.6621 1453.1667 1453.3158 1459.0871 1479.8827 1489.2880 1544.2074 1569.1495 1607.9986 1659.1144 1683.8497 2957.5349 2979.2464 2992.4075 3008.1639 3023.4949 3077.9748 3083.1121 3085.4735 3096.8150 3116.2680 3128.6055 3145.2756 3166.8708 3169.4394
redmass: 7.5059 3.8779 3.4575 2.5237 1.6793 1.8215 3.1756 2.5027 2.0461 3.0655 3.5197 3.5273 7.2430 5.2271 4.5194 4.0148 4.1618 4.1750 4.6790 4.9681 4.0566 4.3950 4.4112 3.2154 3.1116 4.3717 2.8197 5.8087 6.0949 3.4214 2.9815 3.0220 2.4734 3.6076 5.9686 3.0357 1.8251 2.8469 1.8762 2.6537 1.3288 2.1970 3.2662 2.2229 1.6433 2.7038 2.8697 1.2402 1.4441 1.3690 2.7575 1.9307 1.6997 2.2364 1.2964 2.0976 1.4737 1.5121 1.5373 3.8902 1.2795 5.6503 1.4446 1.3598 1.1045 1.0567 1.0479 1.0901 1.0582 1.0554 3.0430 9.3534 8.8908 7.4779 7.1826 10.2861 1.0660 1.0328 1.0624 1.0370 1.0928 1.0997 1.1004 1.0841 1.0971 1.0952 1.1036 1.1011 1.0910 1.0919
irintensity: 2.0586 4.8026 1.2287 8.2859 1.5418 1.2078 0.2854 1.0599 4.8403 2.5450 1.2879 0.4703 2.0446 1.6000 6.4923 0.7391 5.5427 0.8499 15.7047 4.4182 8.1502 3.8325 8.2924 3.8942 4.3552 17.8747 12.1896 9.6952 0.5737 10.0314 9.4888 16.5501 14.3077 13.5566 69.5151 24.5789 14.3605 24.1555 42.4443 38.8425 1.8781 134.6239 45.6904 2.3014 9.0476 63.5003 191.1241 8.5051 10.6461 15.7118 402.1364 43.3234 5.9964 108.7526 72.9024 59.5025 20.6988 1.0537 2.1500 144.8975 47.6923 14.9218 5.9996 3.4131 41.4087 23.8678 25.8892 9.8011 10.1018 22.2197 129.6320 18.7248 202.8701 1.6688 4.2092 156.0176 27.5622 84.1205 12.3453 0.8140 27.6837 20.8088 32.8721 2.1662 5.2642 38.7213 19.5791 10.0589 1.4292 6.4944
temp: 298.150 k
press: 1.00000 atm
elementType: 8 8 8 8 6 6 6 6 6 6 6 6 6 6 6 6 6 6 1 1 1 1 1 1 1 1 1 1 1 1 1 1
symmnumber: 1
zpe: 648956.6 jmol-1
zpe.correction: 0.247175 hartree
zpe.thermalcorrener: 0.264667 hartree
zpe.thermalcorrenthalpy: 0.265611 hartree
zpe.thermalcorrgfe: 0.199890 hartree
zpe.sumelectzpe: -841.446259 hartree
zpe.sumelectthermal: -841.428767 hartree
zpe.sumelectthermalent: -841.427823 hartree
zpe.sumelectthermalfe: -841.493544 hartree
dipole: 2.6729 -2.3395 -2.3586
dipole: 4.2639
quadrupole: -80.8015 -110.4654 -106.9184
quadrupole: 14.3960 -5.8633 1.3152
quadrupole: 18.5936 -11.0703 -7.5233 14.3960 -5.8633 1.3152
hfenergy: -841.693434 hartree
pointgroup: C01 [X(C14H14O4)]
dipole: 0.9929121 -0.9446712 -0.9674145 debye
polarizability: 260.7773165|15.2850668|181.7965777|-10.0862072|2.6518714|93.2017989 unknown
InChI: InChI=1S/C14H14O4/c1-9(15)18-14-7-10-5-3-4-6-12(16)11(10)8-13(14)17-2/h3,5,7-8H,4,6H2,1-2H3
charge 0 multiplicity 1
32 atoms
O  1.874812 2.398014 0.209719
O  2.735754 -0.268022 -0.409542
O  -3.087615 2.300668 0.384266
O  2.792274 -2.217924 0.916885
C  -1.393356 0.603857 0.176257
C  -3.828286 0.081939 0.998938
C  -1.014498 -0.749211 -0.130012
C  -4.285562 -0.946394 -0.06446
C  -2.788651 1.07244 0.486019
C  -1.902089 -1.910348 -0.350691
C  -0.39764 1.61214 0.231246
C  -3.26414 -2.016202 -0.37367
C  0.373095 -1.012952 -0.320061
C  0.968353 1.341547 0.039193
C  1.347019 -0.007638 -0.215186
C  2.804642 2.685032 -0.90485
C  3.379707 -1.385673 0.206653
C  4.847875 -1.351874 -0.146597
H  -3.418414 -0.468736 1.868187
H  -4.692249 0.679455 1.33728
H  -4.583257 -0.418483 -0.996042
H  -5.207009 -1.435401 0.305414
H  -1.350568 -2.831968 -0.585308
H  -0.705339 2.640399 0.443171
H  -3.675164 -2.998348 -0.646624
H  0.691916 -2.034799 -0.542221
H  2.235934 2.9494 -1.816638
H  3.465266 1.825614 -1.106868
H  3.391133 3.552144 -0.566259
H  4.978381 -1.289938 -1.240247
H  5.343087 -2.252747 0.242483
H  5.31739 -0.454389 0.293563
