program: Gaussian 09
title: 000286877
version: EM64L-G09RevD.01
frameworkgroup: C1[X(C11H7N3O6)]
method: RPBEPBE
basis: SDD
operation: Freq
keyword: #p
keyword: freq=noraman
keyword: PBEPBE/SDD
title: #p freq=noraman PBEPBE/SDD
converged: YES YES NO NO
title: Mulliken charges:
elementType: O O O O O O N N N C C C C C C C C C C C H H H H H H H
charge: -0.248010 -0.323791 -0.183927 -0.162061 -0.196475 -0.190721 0.047766 0.011174 0.022042 0.224739 0.289528 -0.474414 0.431768 -0.275815 0.359686 -0.373511 -0.322822 -0.336045 -0.140420 -0.220581 0.334572 0.286488 0.298951 0.317866 0.285860 0.247851 0.290303
chargesum: 0.00000
title: Mulliken charges with hydrogens summed into heavy atoms:
elementType: O O O O O O N N N C C C C C C C C C C C
charge: -0.248010 -0.323791 -0.183927 -0.162061 -0.196475 -0.190721 0.047766 0.011174 0.022042 0.224739 0.289528 -0.139842 0.431768 0.010673 0.359686 -0.074560 -0.004956 -0.050185 0.107431 0.069723
polarizability: 2.63508376e+02 4.30630197e-03 1.75893520e+02 1.67198836e+01 -1.17988415e+01 1.11192446e+02
1716.lowfreq: -4.0195 -2.3041 0.0003 0.0007 0.0008 6.8512 17.5304 28.2175 40.5606
frequency: 17.4009 28.1760 40.5599 52.3327 57.5454 99.5033 143.8080 149.2486 174.9022 201.3271 229.8200 273.2665 305.3404 314.2197 344.4284 384.4151 428.2181 447.9901 484.0018 488.4512 514.6443 525.7768 543.0550 571.3474 615.9204 640.0526 655.5093 666.8904 678.1606 711.0420 719.4461 747.6389 757.0340 780.3789 798.3779 835.2527 853.3485 869.7356 879.5054 952.9764 958.1907 960.5901 990.2106 993.3623 1054.6493 1075.8119 1111.8210 1130.3744 1146.1207 1162.2765 1202.7047 1215.3921 1229.2110 1253.5255 1271.1970 1278.1281 1293.5265 1362.0714 1376.7057 1401.1476 1420.8962 1426.4931 1465.5304 1468.4154 1536.4163 1590.1068 1605.8400 1610.2488 3170.0669 3174.9999 3188.2906 3190.2483 3200.9224 3209.8562 3221.1727
redmass: 6.1154 7.9059 14.3079 9.3742 14.9320 7.8197 12.5660 6.0093 8.2442 5.0050 6.5025 8.0759 8.7684 10.7906 10.6784 7.6338 4.4143 3.2327 5.5985 5.6207 5.5457 7.8324 7.9724 5.4803 7.6990 7.2804 5.0347 2.9482 5.8436 6.3523 7.2477 4.6350 10.6340 1.4473 6.9815 1.5570 1.4960 1.4414 7.4776 1.5086 3.0138 1.3369 1.3713 5.7721 2.2432 1.5817 3.8670 2.3769 1.3085 1.1884 10.0581 8.7988 4.3126 1.5315 5.4465 4.3119 1.4989 6.5098 11.8424 8.4326 2.4665 5.7789 2.8563 3.1195 6.2557 9.0465 6.8112 6.6801 1.0893 1.0898 1.0929 1.0963 1.0959 1.0938 1.0978
irintensity: 1.3996 2.8314 0.4488 0.5336 0.1772 3.7324 3.8644 1.4691 1.1754 2.3898 0.1453 3.2647 1.1635 7.7906 0.3333 2.4631 0.8293 5.0247 0.7540 7.5285 2.2229 6.4675 1.8826 0.9596 10.3581 3.5230 34.3238 5.4987 13.7867 10.7478 18.1563 7.3556 24.3757 49.6171 6.0228 53.3424 18.7265 0.6688 26.7221 34.1301 42.7671 3.3460 2.4879 46.2642 49.6626 7.1336 7.5514 111.6661 64.7517 8.7721 314.2342 381.1145 236.9707 13.6692 132.9022 9.1239 7.1889 87.8071 74.3227 34.3312 60.0259 40.1376 155.9065 111.8739 154.2585 17.8904 134.3346 84.1494 0.6994 6.1430 16.3628 8.3409 1.2994 3.2434 0.9718
temp: 298.150 k
press: 1.00000 atm
elementType: 8 8 8 8 8 8 7 7 7 6 6 6 6 6 6 6 6 6 6 6 1 1 1 1 1 1 1
symmnumber: 1
zpe: 460129.0 jmol-1
zpe.correction: 0.175254 hartree
zpe.thermalcorrener: 0.191853 hartree
zpe.thermalcorrenthalpy: 0.192797 hartree
zpe.thermalcorrgfe: 0.127755 hartree
zpe.sumelectzpe: -1037.303779 hartree
zpe.sumelectthermal: -1037.287180 hartree
zpe.sumelectthermalent: -1037.286236 hartree
zpe.sumelectthermalfe: -1037.351278 hartree
dipole: -5.2102 -0.8721 -4.0446
dipole: 6.6532
quadrupole: -126.2474 -135.6848 -114.5376
quadrupole: -1.7215 13.1055 1.5195
quadrupole: -0.7575 -10.1948 10.9524 -1.7215 13.1055 1.5195
hfenergy: -1037.4790327 hartree
pointgroup: C01 [X(C11H7N3O6)]
dipole: 2.035247 0.7753102 -1.4520371 debye
polarizability: 263.1876695|11.2297489|172.8501362|-13.0631455|18.905872|114.5565365 unknown
InChI: InChI=1S/C11H7N3O6/c15-12-5-1-2-9(7-12)20-11-4-3-8(13(16)17)6-10(11)14(18)19/h1-7H
charge 0 multiplicity 1
27 atoms
O  1.085608 -0.883162 -0.431259
O  3.828206 2.121182 2.140959
O  -1.934996 -3.355768 0.668405
O  -0.160255 -3.250627 -0.765714
O  -4.393363 2.411729 -0.175539
O  -5.167558 0.278352 0.086053
N  3.642551 1.383363 1.053148
N  -1.101707 -2.708891 -0.077706
N  -4.21907 1.135994 -0.080653
C  -0.19229 -0.340627 -0.346621
C  -1.287989 -1.237405 -0.164584
C  -2.604702 -0.757142 -0.057253
C  -2.830883 0.62507 -0.171626
C  -0.456648 1.050281 -0.450409
C  2.252162 -0.080658 -0.28527
C  -1.769984 1.536256 -0.373533
C  2.445283 0.69007 0.870042
C  3.244992 -0.208093 -1.276775
C  4.452459 0.498468 -1.062954
C  4.641289 1.283443 0.078753
H  -3.434021 -1.448837 0.112086
H  0.373094 1.745749 -0.600753
H  -1.98905 2.603049 -0.465759
H  1.727173 0.786171 1.684936
H  3.075951 -0.838782 -2.151182
H  5.264447 0.442812 -1.792671
H  5.544001 1.851902 0.30318
